{"text_format":"1","workbook":"xlsx","n_sheets":3,"sheets":["Zakázka","Nastavení","CADImport"],"not_rendered":{"charts":0,"images":4,"macros":1,"external_links":1,"defined_names":7,"comments":0,"pivot_tables":0},"unopened":[],"bounds":{"document_bytes":16777216,"sheet_cells":100000,"rows_first":2000,"rows_last":500,"rows_between":2000,"halvings":0,"cell_chars":16384,"cell_head_chars":4096},"cells_cut":0,"cells_raw":0,"read":"whole","date_system":"1900"}

{"sheet":"Zakázka","index":0,"n_rows":125,"n_cols":60,"rows_kept":125,"cut":false,"hidden":false,"merged":[[122,2,122,3],[122,4,122,11],[122,12,122,14],[122,15,122,17],[122,18,122,19],[122,20,122,21],[122,22,122,23],[122,24,122,25],[122,26,122,27],[122,28,122,29],[11,2,11,7],[11,8,11,19],[4,2,4,29],[13,2,13,7],[13,8,13,10],[6,8,6,19],[7,8,7,19],[8,8,8,19],[9,8,9,19],[10,8,10,19],[12,8,12,19],[13,11,13,13],[13,14,13,16],[13,17,13,19],[14,11,14,13],[15,11,15,13],[16,11,16,13],[14,14,14,16],[15,14,15,16],[16,14,16,16],[14,17,14,19],[15,17,15,19],[16,17,16,19],[118,28,118,29],[119,28,119,29],[120,28,120,29],[121,28,121,29],[18,2,18,29],[14,2,14,7],[15,2,15,7],[112,28,112,29],[113,28,113,29],[114,28,114,29],[115,28,115,29],[116,28,116,29],[117,28,117,29],[106,28,106,29],[107,28,107,29],[108,28,108,29],[109,28,109,29],[110,28,110,29],[111,28,111,29],[100,28,100,29],[101,28,101,29],[102,28,102,29],[103,28,103,29],[104,28,104,29],[105,28,105,29],[94,28,94,29],[95,28,95,29],[96,28,96,29],[97,28,97,29],[98,28,98,29],[99,28,99,29],[16,8,16,10],[88,28,88,29],[89,28,89,29],[90,28,90,29],[91,28,91,29],[92,28,92,29],[93,28,93,29],[82,28,82,29],[83,28,83,29],[84,28,84,29],[85,28,85,29],[86,28,86,29],[87,28,87,29],[76,28,76,29],[77,28,77,29],[78,28,78,29],[79,28,79,29],[80,28,80,29],[81,28,81,29],[70,28,70,29],[71,28,71,29],[72,28,72,29],[73,28,73,29],[74,28,74,29],[75,28,75,29],[64,28,64,29],[65,28,65,29],[66,28,66,29],[67,28,67,29],[68,28,68,29],[69,28,69,29],[58,28,58,29],[59,28,59,29],[60,28,60,29],[61,28,61,29],[62,28,62,29],[63,28,63,29],[52,28,52,29],[53,28,53,29],[54,28,54,29],[55,28,55,29],[56,28,56,29],[57,28,57,29],[46,28,46,29],[47,28,47,29],[48,28,48,29],[49,28,49,29],[50,28,50,29],[51,28,51,29],[40,28,40,29],[41,28,41,29],[42,28,42,29],[43,28,43,29],[44,28,44,29],[45,28,45,29],[34,28,34,29],[35,28,35,29],[36,28,36,29],[37,28,37,29],[38,28,38,29],[39,28,39,29],[28,28,28,29],[29,28,29,29],[30,28,30,29],[31,28,31,29],[32,28,32,29],[33,28,33,29],[119,26,119,27],[120,26,120,27],[121,26,121,27],[21,28,21,29],[22,28,22,29],[23,28,23,29],[24,28,24,29],[25,28,25,29],[26,28,26,29],[27,28,27,29],[113,26,113,27],[114,26,114,27],[115,26,115,27],[116,26,116,27],[117,26,117,27],[118,26,118,27],[107,26,107,27],[108,26,108,27],[109,26,109,27],[110,26,110,27],[111,26,111,27],[112,26,112,27],[101,26,101,27],[102,26,102,27],[103,26,103,27],[104,26,104,27],[105,26,105,27],[106,26,106,27],[95,26,95,27],[96,26,96,27],[97,26,97,27],[98,26,98,27],[99,26,99,27],[100,26,100,27],[89,26,89,27],[90,26,90,27],[91,26,91,27],[92,26,92,27],[93,26,93,27],[94,26,94,27],[83,26,83,27],[84,26,84,27],[85,26,85,27],[86,26,86,27],[87,26,87,27],[88,26,88,27],[77,26,77,27],[78,26,78,27],[79,26,79,27],[80,26,80,27],[81,26,81,27],[82,26,82,27],[71,26,71,27],[72,26,72,27],[73,26,73,27],[74,26,74,27],[75,26,75,27],[76,26,76,27],[65,26,65,27],[66,26,66,27],[67,26,67,27],[68,26,68,27],[69,26,69,27],[70,26,70,27],[59,26,59,27],[60,26,60,27],[61,26,61,27],[62,26,62,27],[63,26,63,27],[64,26,64,27],[53,26,53,27],[54,26,54,27],[55,26,55,27],[56,26,56,27],[57,26,57,27],[58,26,58,27],[47,26,47,27],[48,26,48,27],[49,26,49,27],[50,26,50,27],[51,26,51,27],[52,26,52,27],[41,26,41,27],[42,26,42,27],[43,26,43,27],[44,26,44,27],[45,26,45,27],[46,26,46,27],[35,26,35,27],[36,26,36,27],[37,26,37,27],[38,26,38,27],[39,26,39,27],[40,26,40,27],[29,26,29,27],[30,26,30,27],[31,26,31,27],[32,26,32,27],[33,26,33,27],[34,26,34,27],[120,24,120,25],[121,24,121,25],[21,26,21,27],[22,26,22,27],[23,26,23,27],[24,26,24,27],[25,26,25,27],[26,26,26,27],[27,26,27,27],[28,26,28,27],[114,24,114,25],[115,24,115,25],[116,24,116,25],[117,24,117,25],[118,24,118,25],[119,24,119,25],[108,24,108,25],[109,24,109,25],[110,24,110,25],[111,24,111,25],[112,24,112,25],[113,24,113,25],[102,24,102,25],[103,24,103,25],[104,24,104,25],[105,24,105,25],[106,24,106,25],[107,24,107,25],[96,24,96,25],[97,24,97,25],[98,24,98,25],[99,24,99,25],[100,24,100,25],[101,24,101,25],[90,24,90,25],[91,24,91,25],[92,24,92,25],[93,24,93,25],[94,24,94,25],[95,24,95,25],[84,24,84,25],[85,24,85,25],[86,24,86,25],[87,24,87,25],[88,24,88,25],[89,24,89,25],[78,24,78,25],[79,24,79,25],[80,24,80,25],[81,24,81,25],[82,24,82,25],[83,24,83,25],[72,24,72,25],[73,24,73,25],[74,24,74,25],[75,24,75,25],[76,24,76,25],[77,24,77,25],[66,24,66,25],[67,24,67,25],[68,24,68,25],[69,24,69,25],[70,24,70,25],[71,24,71,25],[60,24,60,25],[61,24,61,25],[62,24,62,25],[63,24,63,25],[64,24,64,25],[65,24,65,25],[54,24,54,25],[55,24,55,25],[56,24,56,25],[57,24,57,25],[58,24,58,25],[59,24,59,25],[48,24,48,25],[49,24,49,25],[50,24,50,25],[51,24,51,25],[52,24,52,25],[53,24,53,25],[42,24,42,25],[43,24,43,25],[44,24,44,25],[45,24,45,25],[46,24,46,25],[47,24,47,25],[36,24,36,25],[37,24,37,25],[38,24,38,25],[39,24,39,25],[40,24,40,25],[41,24,41,25],[30,24,30,25],[31,24,31,25],[32,24,32,25],[33,24,33,25],[34,24,34,25],[35,24,35,25],[121,22,121,23],[21,24,21,25],[22,24,22,25],[23,24,23,25],[24,24,24,25],[25,24,25,25],[26,24,26,25],[27,24,27,25],[28,24,28,25],[29,24,29,25],[115,22,115,23],[116,22,116,23],[117,22,117,23],[118,22,118,23],[119,22,119,23],[120,22,120,23],[109,22,109,23],[110,22,110,23],[111,22,111,23],[112,22,112,23],[113,22,113,23],[114,22,114,23],[103,22,103,23],[104,22,104,23],[105,22,105,23],[106,22,106,23],[107,22,107,23],[108,22,108,23],[97,22,97,23],[98,22,98,23],[99,22,99,23],[100,22,100,23],[101,22,101,23],[102,22,102,23],[91,22,91,23],[92,22,92,23],[93,22,93,23],[94,22,94,23],[95,22,95,23],[96,22,96,23],[85,22,85,23],[86,22,86,23],[87,22,87,23],[88,22,88,23],[89,22,89,23],[90,22,90,23],[79,22,79,23],[80,22,80,23],[81,22,81,23],[82,22,82,23],[83,22,83,23],[84,22,84,23],[73,22,73,23],[74,22,74,23],[75,22,75,23],[76,22,76,23],[77,22,77,23],[78,22,78,23],[67,22,67,23],[68,22,68,23],[69,22,69,23],[70,22,70,23],[71,22,71,23],[72,22,72,23],[61,22,61,23],[62,22,62,23],[63,22,63,23],[64,22,64,23],[65,22,65,23],[66,22,66,23],[55,22,55,23],[56,22,56,23],[57,22,57,23],[58,22,58,23],[59,22,59,23],[60,22,60,23],[49,22,49,23],[50,22,50,23],[51,22,51,23],[52,22,52,23],[53,22,53,23],[54,22,54,23],[43,22,43,23],[44,22,44,23],[45,22,45,23],[46,22,46,23],[47,22,47,23],[48,22,48,23],[37,22,37,23],[38,22,38,23],[39,22,39,23],[40,22,40,23],[41,22,41,23],[42,22,42,23],[31,22,31,23],[32,22,32,23],[33,22,33,23],[34,22,34,23],[35,22,35,23],[36,22,36,23],[25,22,25,23],[26,22,26,23],[27,22,27,23],[28,22,28,23],[29,22,29,23],[30,22,30,23],[20,22,20,29],[21,22,21,23],[22,22,22,23],[23,22,23,23],[24,22,24,23],[116,20,116,21],[117,20,117,21],[118,20,118,21],[119,20,119,21],[120,20,120,21],[121,20,121,21],[110,20,110,21],[111,20,111,21],[112,20,112,21],[113,20,113,21],[114,20,114,21],[115,20,115,21],[104,20,104,21],[105,20,105,21],[106,20,106,21],[107,20,107,21],[108,20,108,21],[109,20,109,21],[98,20,98,21],[99,20,99,21],[100,20,100,21],[101,20,101,21],[102,20,102,21],[103,20,103,21],[92,20,92,21],[93,20,93,21],[94,20,94,21],[95,20,95,21],[96,20,96,21],[97,20,97,21],[86,20,86,21],[87,20,87,21],[88,20,88,21],[89,20,89,21],[90,20,90,21],[91,20,91,21],[80,20,80,21],[81,20,81,21],[82,20,82,21],[83,20,83,21],[84,20,84,21],[85,20,85,21],[74,20,74,21],[75,20,75,21],[76,20,76,21],[77,20,77,21],[78,20,78,21],[79,20,79,21],[68,20,68,21],[69,20,69,21],[70,20,70,21],[71,20,71,21],[72,20,72,21],[73,20,73,21],[62,20,62,21],[63,20,63,21],[64,20,64,21],[65,20,65,21],[66,20,66,21],[67,20,67,21],[56,20,56,21],[57,20,57,21],[58,20,58,21],[59,20,59,21],[60,20,60,21],[61,20,61,21],[50,20,50,21],[51,20,51,21],[52,20,52,21],[53,20,53,21],[54,20,54,21],[55,20,55,21],[44,20,44,21],[45,20,45,21],[46,20,46,21],[47,20,47,21],[48,20,48,21],[49,20,49,21],[38,20,38,21],[39,20,39,21],[40,20,40,21],[41,20,41,21],[42,20,42,21],[43,20,43,21],[32,20,32,21],[33,20,33,21],[34,20,34,21],[35,20,35,21],[36,20,36,21],[37,20,37,21],[26,20,26,21],[27,20,27,21],[28,20,28,21],[29,20,29,21],[30,20,30,21],[31,20,31,21],[20,20,20,21],[21,20,21,21],[22,20,22,21],[23,20,23,21],[24,20,24,21],[25,20,25,21],[116,18,116,19],[117,18,117,19],[118,18,118,19],[119,18,119,19],[120,18,120,19],[121,18,121,19],[110,18,110,19],[111,18,111,19],[112,18,112,19],[113,18,113,19],[114,18,114,19],[115,18,115,19],[104,18,104,19],[105,18,105,19],[106,18,106,19],[107,18,107,19],[108,18,108,19],[109,18,109,19],[98,18,98,19],[99,18,99,19],[100,18,100,19],[101,18,101,19],[102,18,102,19],[103,18,103,19],[92,18,92,19],[93,18,93,19],[66,18,66,19],[67,18,67,19],[56,18,56,19],[57,18,57,19],[58,18,58,19],[59,18,59,19],[60,18,60,19],[61,18,61,19],[94,18,94,19],[95,18,95,19],[96,18,96,19],[97,18,97,19],[86,18,86,19],[87,18,87,19],[88,18,88,19],[89,18,89,19],[90,18,90,19],[91,18,91,19],[80,18,80,19],[81,18,81,19],[82,18,82,19],[83,18,83,19],[84,18,84,19],[85,18,85,19],[74,18,74,19],[75,18,75,19],[76,18,76,19],[77,18,77,19],[78,18,78,19],[79,18,79,19],[20,18,20,19],[21,18,21,19],[22,18,22,19],[23,18,23,19],[24,18,24,19],[25,18,25,19],[50,18,50,19],[51,18,51,19],[52,18,52,19],[53,18,53,19],[54,18,54,19],[55,18,55,19],[44,18,44,19],[45,18,45,19],[46,18,46,19],[47,18,47,19],[48,18,48,19],[49,18,49,19],[38,18,38,19],[39,18,39,19],[40,18,40,19],[41,18,41,19],[42,18,42,19],[43,18,43,19],[94,15,94,17],[95,15,95,17],[96,15,96,17],[97,15,97,17],[86,15,86,17],[87,15,87,17],[88,15,88,17],[89,15,89,17],[90,15,90,17],[91,15,91,17],[32,18,32,19],[33,18,33,19],[34,18,34,19],[35,18,35,19],[36,18,36,19],[37,18,37,19],[26,18,26,19],[27,18,27,19],[28,18,28,19],[29,18,29,19],[30,18,30,19],[31,18,31,19],[68,18,68,19],[69,18,69,19],[70,18,70,19],[71,18,71,19],[72,18,72,19],[73,18,73,19],[62,18,62,19],[63,18,63,19],[64,18,64,19],[65,18,65,19],[80,15,80,17],[81,15,81,17],[82,15,82,17],[121,15,121,17],[110,15,110,17],[111,15,111,17],[112,15,112,17],[113,15,113,17],[114,15,114,17],[115,15,115,17],[104,15,104,17],[105,15,105,17],[106,15,106,17],[107,15,107,17],[108,15,108,17],[109,15,109,17],[98,15,98,17],[99,15,99,17],[100,15,100,17],[101,15,101,17],[102,15,102,17],[103,15,103,17],[83,15,83,17],[84,15,84,17],[85,15,85,17],[116,15,116,17],[117,15,117,17],[118,15,118,17],[119,15,119,17],[120,15,120,17],[92,15,92,17],[93,15,93,17],[74,15,74,17],[75,15,75,17],[76,15,76,17],[77,15,77,17],[78,15,78,17],[79,15,79,17],[68,15,68,17],[69,15,69,17],[70,15,70,17],[71,15,71,17],[72,15,72,17],[73,15,73,17],[62,15,62,17],[63,15,63,17],[64,15,64,17],[65,15,65,17],[66,15,66,17],[67,15,67,17],[56,15,56,17],[57,15,57,17],[58,15,58,17],[59,15,59,17],[60,15,60,17],[61,15,61,17],[50,15,50,17],[51,15,51,17],[52,15,52,17],[53,15,53,17],[54,15,54,17],[55,15,55,17],[44,15,44,17],[45,15,45,17],[46,15,46,17],[47,15,47,17],[48,15,48,17],[49,15,49,17],[38,15,38,17],[39,15,39,17],[40,15,40,17],[41,15,41,17],[42,15,42,17],[43,15,43,17],[32,15,32,17],[33,15,33,17],[34,15,34,17],[35,15,35,17],[36,15,36,17],[37,15,37,17],[26,15,26,17],[27,15,27,17],[28,15,28,17],[29,15,29,17],[30,15,30,17],[31,15,31,17],[20,15,20,17],[21,15,21,17],[22,15,22,17],[23,15,23,17],[24,15,24,17],[25,15,25,17],[116,12,116,14],[117,12,117,14],[118,12,118,14],[119,12,119,14],[120,12,120,14],[121,12,121,14],[110,12,110,14],[111,12,111,14],[112,12,112,14],[113,12,113,14],[114,12,114,14],[115,12,115,14],[104,12,104,14],[105,12,105,14],[106,12,106,14],[107,12,107,14],[108,12,108,14],[109,12,109,14],[98,12,98,14],[99,12,99,14],[100,12,100,14],[101,12,101,14],[102,12,102,14],[103,12,103,14],[92,12,92,14],[93,12,93,14],[94,12,94,14],[95,12,95,14],[96,12,96,14],[97,12,97,14],[86,12,86,14],[87,12,87,14],[88,12,88,14],[89,12,89,14],[90,12,90,14],[91,12,91,14],[80,12,80,14],[81,12,81,14],[82,12,82,14],[83,12,83,14],[84,12,84,14],[85,12,85,14],[74,12,74,14],[75,12,75,14],[76,12,76,14],[77,12,77,14],[78,12,78,14],[79,12,79,14],[69,12,69,14],[70,12,70,14],[71,12,71,14],[72,12,72,14],[73,12,73,14],[62,12,62,14],[63,12,63,14],[64,12,64,14],[65,12,65,14],[66,12,66,14],[67,12,67,14],[56,12,56,14],[57,12,57,14],[58,12,58,14],[59,12,59,14],[60,12,60,14],[61,12,61,14],[52,12,52,14],[53,12,53,14],[54,12,54,14],[55,12,55,14],[44,12,44,14],[45,12,45,14],[46,12,46,14],[47,12,47,14],[48,12,48,14],[49,12,49,14],[38,12,38,14],[39,12,39,14],[40,12,40,14],[41,12,41,14],[42,12,42,14],[43,12,43,14],[68,12,68,14],[35,12,35,14],[36,12,36,14],[37,12,37,14],[26,12,26,14],[27,12,27,14],[28,12,28,14],[29,12,29,14],[30,12,30,14],[31,12,31,14],[20,12,20,14],[21,12,21,14],[22,12,22,14],[23,12,23,14],[24,12,24,14],[25,12,25,14],[50,12,50,14],[51,12,51,14],[121,4,121,11],[6,2,6,7],[7,2,7,7],[8,2,8,7],[9,2,9,7],[10,2,10,7],[12,2,12,7],[16,2,16,7],[14,8,14,10],[15,8,15,10],[115,4,115,11],[116,4,116,11],[117,4,117,11],[118,4,118,11],[119,4,119,11],[120,4,120,11],[109,4,109,11],[110,4,110,11],[111,4,111,11],[112,4,112,11],[113,4,113,11],[114,4,114,11],[103,4,103,11],[104,4,104,11],[105,4,105,11],[106,4,106,11],[107,4,107,11],[108,4,108,11],[97,4,97,11],[98,4,98,11],[99,4,99,11],[100,4,100,11],[101,4,101,11],[102,4,102,11],[91,4,91,11],[92,4,92,11],[93,4,93,11],[94,4,94,11],[95,4,95,11],[96,4,96,11],[85,4,85,11],[86,4,86,11],[87,4,87,11],[88,4,88,11],[89,4,89,11],[90,4,90,11],[79,4,79,11],[80,4,80,11],[81,4,81,11],[82,4,82,11],[83,4,83,11],[84,4,84,11],[74,4,74,11],[75,4,75,11],[76,4,76,11],[77,4,77,11],[78,4,78,11],[67,4,67,11],[68,4,68,11],[69,4,69,11],[70,4,70,11],[71,4,71,11],[72,4,72,11],[61,4,61,11],[62,4,62,11],[63,4,63,11],[64,4,64,11],[65,4,65,11],[66,4,66,11],[57,4,57,11],[58,4,58,11],[59,4,59,11],[60,4,60,11],[49,4,49,11],[50,4,50,11],[51,4,51,11],[52,4,52,11],[53,4,53,11],[54,4,54,11],[43,4,43,11],[44,4,44,11],[45,4,45,11],[46,4,46,11],[47,4,47,11],[48,4,48,11],[73,4,73,11],[40,4,40,11],[41,4,41,11],[42,4,42,11],[31,4,31,11],[32,4,32,11],[33,4,33,11],[34,4,34,11],[35,4,35,11],[36,4,36,11],[25,4,25,11],[26,4,26,11],[27,4,27,11],[28,4,28,11],[29,4,29,11],[30,4,30,11],[55,4,55,11],[56,4,56,11],[118,2,118,3],[119,2,119,3],[120,2,120,3],[121,2,121,3],[20,4,20,11],[21,4,21,11],[22,4,22,11],[23,4,23,11],[24,4,24,11],[112,2,112,3],[113,2,113,3],[114,2,114,3],[115,2,115,3],[116,2,116,3],[117,2,117,3],[106,2,106,3],[107,2,107,3],[108,2,108,3],[109,2,109,3],[110,2,110,3],[111,2,111,3],[100,2,100,3],[101,2,101,3],[102,2,102,3],[103,2,103,3],[104,2,104,3],[105,2,105,3],[94,2,94,3],[95,2,95,3],[96,2,96,3],[97,2,97,3],[98,2,98,3],[99,2,99,3],[88,2,88,3],[89,2,89,3],[90,2,90,3],[91,2,91,3],[92,2,92,3],[93,2,93,3],[82,2,82,3],[83,2,83,3],[84,2,84,3],[85,2,85,3],[86,2,86,3],[87,2,87,3],[76,2,76,3],[77,2,77,3],[78,2,78,3],[79,2,79,3],[80,2,80,3]],"merged_total":1069,"flags":["merged_cut"]}
[]
[]
[]
[]
[null,null,"FORMULÁR PRE FORMÁTOVANIE"]
[null,null,null,null,null,null,null,null,null,null,null,null,null,null,null,null,null,null,null,null,null,null,null,null,null,null,null,null,null,null,null,null,"Na každý materiál treba vyplniť samostatný formulár!!!!!!!"]
[null,null,"Názov projektu:",null,null,null,null,null,"ZAV-TAS príklad vyplnenia porezu"]
[null,null,"Popis projektu:",null,null,null,null,null,"Kuchyňa"]
[null,null,"Datum projektu:",null,null,null,null,null,{"$f":"NOW()","v":"2020-03-09T16:33:51.830"}]
[null,null,"Materiál: ",null,null,null,null,null,"H1180 egger"]
[null,null,"Hrúbka:",null,null,null,null,null,"18"]
[null,null,"Dekor (textura):",null,null,null,null,null,1]
[null,null,"Olepenie:  ",null,null,null,null,null,"H1180 egger"]
[null,null,"Značka olepenia:",null,null,null,null,null,"Hrúbka:",null,null,"Dĺžka (mm):",null,null,"Orez (mm):",null,null,"Predfréz (mm):"]
[null,null,"E",null,null,null,null,null,2,null,null,{"$f":"BD22","v":530},null,null,30,null,null,0]
[null,null,"F",null,null,null,null,null,1,null,null,{"$f":"BE22","v":2320},null,null,30,null,null,0]
[null,null,"I",null,null,null,null,null,0.5,null,null,{"$f":"BF22","v":430},null,null,30,null,null,0]
[]
[null,null,"Rozmer dielcov zadávejte vrátane olepenia ! ",null,null,null,null,null,null,null,null,null,null,null,null,null,null,null,null,null,null,null,null,null,null,null,null,null,null,null,null,null,null,null,null,null,null,null,null,null,null,null,null,null,null,null,null,null,null,null,null,null,null,null,null,null,null,null,"EXPORTNÍ"]
[null,null,null,null,null,null,null,null,null,null,null,null,null,null,null,null,null,null,null,null,null,null,null,null,null,null,null,null,null,null,null,null,null,null,null,null,null,null,null,null,null,null,null,null,null,null,null,null,null,null,null,null,null,"rozměr dílce",null,"délka hrany",null,null,"rozměr dílce"]
[null,null,"Číslo",null,"Označenie dielu",null,null,null,null,null,null,null,"Dĺžka (Y)",null,null,"Šírka (X)",null,null,"Počet",null,"Číslo",null,"Olepenie hrany (E,F,I)",null,null,null,null,null,null,null,null,null,null,null,null,null,null,null,null,null,null,null,null,null,null,null,null,null,null,null,null,null,null,"bez hrany",null,"E","F","I","s predfrezem"]
[null,null,"Dielu",null,{"$f":"CONCATENATE(\"počet dielov: \",COUNTIF(E23:E122,\"*\"),\"ks\")","v":"počet dielov: 4ks"},null,null,null,null,null,null,null,"(mm)",null,null,"(mm)",null,null,"kusov",null,"skrine",null," Y1",null," Y2",null," X1",null," X2",null,null,null,"        Poznámky:",null,null,null,null,null,null,null,null,null,null,null,null,null,null,null,null,null,null,null,null,null,null,{"$f":"SUM(BD23:BD122)","v":530},{"$f":"SUM(BE23:BE122)","v":2320},{"$f":"SUM(BF23:BF122)","v":430}]
[null,null,1,null,"bok",null,null,null,null,null,null,null,800,null,null,400,null,null,1,null,1,null,"F",null,null,null,"F",null,"F",null,null,null,null,null,null,null,null,null,null,null,null,null,null,null,null,null,null,null,null,null,null,null,{"$f":"IF(P23=\"\",\"\",CONCATENATE(IF(AA23=\"\",\"N\",AA23),IF(Y23=\"\",\"N\",Y23),IF(AC23=\"\",\"N\",AC23),IF(W23=\"\",\"N\",W23)))","v":"FNFF"},{"$f":"IF(ISBLANK(P23),CHAR(32),P23-(IF((W23=\"E\"),$I$15,(IF((W23=\"F\"),$I$16,(IF((W23=\"I\"),$I$17,(IF((W23=\"C\"),0.5,0))))))))-(IF((Y23=\"E\"),$I$15,(IF((Y23=\"F\"),$I$16,(IF((Y23=\"I\"),$I$17,(IF((Y23=\"C\"),0.5,0)))))))))","v":399},{"$f":"IF(ISBLANK(M23),CHAR(32),M23-(IF((AA23=\"E\"),2,(IF((AA23=\"F\"),1,(IF((AA23=\"I\"),0.5,(IF((AA23=\"C\"),0.5,0))))))))-(IF((AC23=\"E\"),2,(IF((AC23=\"F\"),1,(IF((AC23=\"I\"),0.5,(IF((AC23=\"C\"),0.5,0)))))))))","v":798},{"$f":"IF($C$15=MID(BA23,1,1),(P23+$O$15)*S23,0)+IF($C$15=MID(BA23,2,1),(M23+$O$15)*S23,0)+IF($C$15=MID(BA23,3,1),(P23+$O$15)*S23,0)+IF($C$15=MID(BA23,4,1),(M23+$O$15)*S23,0)","v":0},{"$f":"IF($C$16=MID(BA23,1,1),(P23+$O$16)*S23,0)+IF($C$16=MID(BA23,2,1),(M23+$O$16)*S23,0)+IF($C$16=MID(BA23,3,1),(P23+$O$16)*S23,0)+IF($C$16=MID(BA23,4,1),(M23+$O$16)*S23,0)","v":1690},{"$f":"IF($C$17=MID(BA23,1,1),(P23+$O$17)*S23,0)+IF($C$17=MID(BA23,2,1),(M23+$O$17)*S23,0)+IF($C$17=MID(BA23,3,1),(P23+$O$17)*S23,0)+IF($C$17=MID(BA23,4,1),(M23+$O$17)*S23,0)","v":0},{"$f":"IF(ISBLANK(P23),CHAR(32),BB23+(IF((W23=\"E\"),$R$15,(IF((W23=\"F\"),$R$16,(IF((W23=\"I\"),$R$17,(IF((W23=\"C\"),0.5,0))))))))+(IF((Y23=\"E\"),$R$15,(IF((Y23=\"F\"),$R$16,(IF((Y23=\"I\"),$R$17,(IF((Y23=\"C\"),0.5,0)))))))))","v":399},{"$f":"IF(ISBLANK(M23),CHAR(32),BC23+(IF((AA23=\"E\"),$R$15,(IF((AA23=\"F\"),$R$16,(IF((AA23=\"I\"),$R$17,(IF((AA23=\"C\"),0.5,0))))))))+(IF((AC23=\"E\"),$R$15,(IF((AC23=\"F\"),$R$16,(IF((AC23=\"I\"),$R$17,(IF((AC23=\"C\"),0.5,0)))))))))","v":798}]
[null,null,2,null,"dno",null,null,null,null,null,null,null,600,null,null,400,null,null,1,null,1,null,"F",null,null,null,null,null,null,null,null,null,null,null,null,null,null,null,null,null,null,null,null,null,null,null,null,null,null,null,null,null,{"$f":"IF(P24=\"\",\"\",CONCATENATE(IF(AA24=\"\",\"N\",AA24),IF(Y24=\"\",\"N\",Y24),IF(AC24=\"\",\"N\",AC24),IF(W24=\"\",\"N\",W24)))","v":"NNNF"},{"$f":"IF(ISBLANK(P24),CHAR(32),P24-(IF((W24=\"E\"),$I$15,(IF((W24=\"F\"),$I$16,(IF((W24=\"I\"),$I$17,(IF((W24=\"C\"),0.5,0))))))))-(IF((Y24=\"E\"),$I$15,(IF((Y24=\"F\"),$I$16,(IF((Y24=\"I\"),$I$17,(IF((Y24=\"C\"),0.5,0)))))))))","v":399},{"$f":"IF(ISBLANK(M24),CHAR(32),M24-(IF((AA24=\"E\"),2,(IF((AA24=\"F\"),1,(IF((AA24=\"I\"),0.5,(IF((AA24=\"C\"),0.5,0))))))))-(IF((AC24=\"E\"),2,(IF((AC24=\"F\"),1,(IF((AC24=\"I\"),0.5,(IF((AC24=\"C\"),0.5,0)))))))))","v":600},{"$f":"IF($C$15=MID(BA24,1,1),(P24+$O$15)*S24,0)+IF($C$15=MID(BA24,2,1),(M24+$O$15)*S24,0)+IF($C$15=MID(BA24,3,1),(P24+$O$15)*S24,0)+IF($C$15=MID(BA24,4,1),(M24+$O$15)*S24,0)","v":0},{"$f":"IF($C$16=MID(BA24,1,1),(P24+$O$16)*S24,0)+IF($C$16=MID(BA24,2,1),(M24+$O$16)*S24,0)+IF($C$16=MID(BA24,3,1),(P24+$O$16)*S24,0)+IF($C$16=MID(BA24,4,1),(M24+$O$16)*S24,0)","v":630},{"$f":"IF($C$17=MID(BA24,1,1),(P24+$O$17)*S24,0)+IF($C$17=MID(BA24,2,1),(M24+$O$17)*S24,0)+IF($C$17=MID(BA24,3,1),(P24+$O$17)*S24,0)+IF($C$17=MID(BA24,4,1),(M24+$O$17)*S24,0)","v":0},{"$f":"IF(ISBLANK(P24),CHAR(32),BB24+(IF((W24=\"E\"),$R$15,(IF((W24=\"F\"),$R$16,(IF((W24=\"I\"),$R$17,(IF((W24=\"C\"),0.5,0))))))))+(IF((Y24=\"E\"),$R$15,(IF((Y24=\"F\"),$R$16,(IF((Y24=\"I\"),$R$17,(IF((Y24=\"C\"),0.5,0)))))))))","v":399},{"$f":"IF(ISBLANK(M24),CHAR(32),BC24+(IF((AA24=\"E\"),$R$15,(IF((AA24=\"F\"),$R$16,(IF((AA24=\"I\"),$R$17,(IF((AA24=\"C\"),0.5,0))))))))+(IF((AC24=\"E\"),$R$15,(IF((AC24=\"F\"),$R$16,(IF((AC24=\"I\"),$R$17,(IF((AC24=\"C\"),0.5,0)))))))))","v":600}]
[null,null,3,null,"medzistena",null,null,null,null,null,null,null,400,null,null,600,null,null,1,null,1,null,"I",null,null,null,null,null,null,null,null,null,null,null,null,null,null,null,null,null,null,null,null,null,null,null,null,null,null,null,null,null,{"$f":"IF(P25=\"\",\"\",CONCATENATE(IF(AA25=\"\",\"N\",AA25),IF(Y25=\"\",\"N\",Y25),IF(AC25=\"\",\"N\",AC25),IF(W25=\"\",\"N\",W25)))","v":"NNNI"},{"$f":"IF(ISBLANK(P25),CHAR(32),P25-(IF((W25=\"E\"),$I$15,(IF((W25=\"F\"),$I$16,(IF((W25=\"I\"),$I$17,(IF((W25=\"C\"),0.5,0))))))))-(IF((Y25=\"E\"),$I$15,(IF((Y25=\"F\"),$I$16,(IF((Y25=\"I\"),$I$17,(IF((Y25=\"C\"),0.5,0)))))))))","v":599.5},{"$f":"IF(ISBLANK(M25),CHAR(32),M25-(IF((AA25=\"E\"),2,(IF((AA25=\"F\"),1,(IF((AA25=\"I\"),0.5,(IF((AA25=\"C\"),0.5,0))))))))-(IF((AC25=\"E\"),2,(IF((AC25=\"F\"),1,(IF((AC25=\"I\"),0.5,(IF((AC25=\"C\"),0.5,0)))))))))","v":400},{"$f":"IF($C$15=MID(BA25,1,1),(P25+$O$15)*S25,0)+IF($C$15=MID(BA25,2,1),(M25+$O$15)*S25,0)+IF($C$15=MID(BA25,3,1),(P25+$O$15)*S25,0)+IF($C$15=MID(BA25,4,1),(M25+$O$15)*S25,0)","v":0},{"$f":"IF($C$16=MID(BA25,1,1),(P25+$O$16)*S25,0)+IF($C$16=MID(BA25,2,1),(M25+$O$16)*S25,0)+IF($C$16=MID(BA25,3,1),(P25+$O$16)*S25,0)+IF($C$16=MID(BA25,4,1),(M25+$O$16)*S25,0)","v":0},{"$f":"IF($C$17=MID(BA25,1,1),(P25+$O$17)*S25,0)+IF($C$17=MID(BA25,2,1),(M25+$O$17)*S25,0)+IF($C$17=MID(BA25,3,1),(P25+$O$17)*S25,0)+IF($C$17=MID(BA25,4,1),(M25+$O$17)*S25,0)","v":430},{"$f":"IF(ISBLANK(P25),CHAR(32),BB25+(IF((W25=\"E\"),$R$15,(IF((W25=\"F\"),$R$16,(IF((W25=\"I\"),$R$17,(IF((W25=\"C\"),0.5,0))))))))+(IF((Y25=\"E\"),$R$15,(IF((Y25=\"F\"),$R$16,(IF((Y25=\"I\"),$R$17,(IF((Y25=\"C\"),0.5,0)))))))))","v":599.5},{"$f":"IF(ISBLANK(M25),CHAR(32),BC25+(IF((AA25=\"E\"),$R$15,(IF((AA25=\"F\"),$R$16,(IF((AA25=\"I\"),$R$17,(IF((AA25=\"C\"),0.5,0))))))))+(IF((AC25=\"E\"),$R$15,(IF((AC25=\"F\"),$R$16,(IF((AC25=\"I\"),$R$17,(IF((AC25=\"C\"),0.5,0)))))))))","v":400}]
[null,null,4,null,"medzistena",null,null,null,null,null,null,null,500,null,null,800,null,null,1,null,1,null,"E",null,null,null,null,null,null,null,null,null,"Dupla H1181/H1181 alebo H1181/W980",null,null,null,null,null,null,null,null,null,null,null,null,null,null,null,null,null,null,null,"NNNE",798,500,530,0,0,798,500]
[null,null,5,null,null,null,null,null,null,null,null,null,null,null,null,null,null,null,null,null,null,null,null,null,null,null,null,null,null,null,null,null,null,null,null,null,null,null,null,null,null,null,null,null,null,null,null,null,null,null,null,null,""," "," ",0,0,0," "," "]
[null,null,6,null,null,null,null,null,null,null,null,null,null,null,null,null,null,null,null,null,null,null,null,null,null,null,null,null,null,null,null,null,null,null,null,null,null,null,null,null,null,null,null,null,null,null,null,null,null,null,null,null,""," "," ",0,0,0," "," "]
[null,null,7,null,null,null,null,null,null,null,null,null,null,null,null,null,null,null,null,null,null,null,null,null,null,null,null,null,null,null,null,null,null,null,null,null,null,null,null,null,null,null,null,null,null,null,null,null,null,null,null,null,""," "," ",0,0,0," "," "]
[null,null,8,null,null,null,null,null,null,null,null,null,null,null,null,null,null,null,null,null,null,null,null,null,null,null,null,null,null,null,null,null,null,null,null,null,null,null,null,null,null,null,null,null,null,null,null,null,null,null,null,null,""," "," ",0,0,0," "," "]
[null,null,9,null,null,null,null,null,null,null,null,null,null,null,null,null,null,null,null,null,null,null,null,null,null,null,null,null,null,null,null,null,null,null,null,null,null,null,null,null,null,null,null,null,null,null,null,null,null,null,null,null,{"$f":"IF(P31=\"\",\"\",CONCATENATE(IF(AA31=\"\",\"N\",AA31),IF(Y31=\"\",\"N\",Y31),IF(AC31=\"\",\"N\",AC31),IF(W31=\"\",\"N\",W31)))","v":""},{"$f":"IF(ISBLANK(P31),CHAR(32),P31-(IF((W31=\"E\"),$I$15,(IF((W31=\"F\"),$I$16,(IF((W31=\"I\"),$I$17,(IF((W31=\"C\"),0.5,0))))))))-(IF((Y31=\"E\"),$I$15,(IF((Y31=\"F\"),$I$16,(IF((Y31=\"I\"),$I$17,(IF((Y31=\"C\"),0.5,0)))))))))","v":" "},{"$f":"IF(ISBLANK(M31),CHAR(32),M31-(IF((AA31=\"E\"),2,(IF((AA31=\"F\"),1,(IF((AA31=\"I\"),0.5,(IF((AA31=\"C\"),0.5,0))))))))-(IF((AC31=\"E\"),2,(IF((AC31=\"F\"),1,(IF((AC31=\"I\"),0.5,(IF((AC31=\"C\"),0.5,0)))))))))","v":" "},{"$f":"IF($C$15=MID(BA31,1,1),(P31+$O$15)*S31,0)+IF($C$15=MID(BA31,2,1),(M31+$O$15)*S31,0)+IF($C$15=MID(BA31,3,1),(P31+$O$15)*S31,0)+IF($C$15=MID(BA31,4,1),(M31+$O$15)*S31,0)","v":0},{"$f":"IF($C$16=MID(BA31,1,1),(P31+$O$16)*S31,0)+IF($C$16=MID(BA31,2,1),(M31+$O$16)*S31,0)+IF($C$16=MID(BA31,3,1),(P31+$O$16)*S31,0)+IF($C$16=MID(BA31,4,1),(M31+$O$16)*S31,0)","v":0},{"$f":"IF($C$17=MID(BA31,1,1),(P31+$O$17)*S31,0)+IF($C$17=MID(BA31,2,1),(M31+$O$17)*S31,0)+IF($C$17=MID(BA31,3,1),(P31+$O$17)*S31,0)+IF($C$17=MID(BA31,4,1),(M31+$O$17)*S31,0)","v":0},{"$f":"IF(ISBLANK(P31),CHAR(32),BB31+(IF((W31=\"E\"),$R$15,(IF((W31=\"F\"),$R$16,(IF((W31=\"I\"),$R$17,(IF((W31=\"C\"),0.5,0))))))))+(IF((Y31=\"E\"),$R$15,(IF((Y31=\"F\"),$R$16,(IF((Y31=\"I\"),$R$17,(IF((Y31=\"C\"),0.5,0)))))))))","v":" "},{"$f":"IF(ISBLANK(M31),CHAR(32),BC31+(IF((AA31=\"E\"),$R$15,(IF((AA31=\"F\"),$R$16,(IF((AA31=\"I\"),$R$17,(IF((AA31=\"C\"),0.5,0))))))))+(IF((AC31=\"E\"),$R$15,(IF((AC31=\"F\"),$R$16,(IF((AC31=\"I\"),$R$17,(IF((AC31=\"C\"),0.5,0)))))))))","v":" "}]
[null,null,10,null,null,null,null,null,null,null,null,null,null,null,null,null,null,null,null,null,null,null,null,null,null,null,null,null,null,null,null,null,null,null,null,null,null,null,null,null,null,null,null,null,null,null,null,null,null,null,null,null,{"$f":"IF(P32=\"\",\"\",CONCATENATE(IF(AA32=\"\",\"N\",AA32),IF(Y32=\"\",\"N\",Y32),IF(AC32=\"\",\"N\",AC32),IF(W32=\"\",\"N\",W32)))","v":""},{"$f":"IF(ISBLANK(P32),CHAR(32),P32-(IF((W32=\"E\"),$I$15,(IF((W32=\"F\"),$I$16,(IF((W32=\"I\"),$I$17,(IF((W32=\"C\"),0.5,0))))))))-(IF((Y32=\"E\"),$I$15,(IF((Y32=\"F\"),$I$16,(IF((Y32=\"I\"),$I$17,(IF((Y32=\"C\"),0.5,0)))))))))","v":" "},{"$f":"IF(ISBLANK(M32),CHAR(32),M32-(IF((AA32=\"E\"),2,(IF((AA32=\"F\"),1,(IF((AA32=\"I\"),0.5,(IF((AA32=\"C\"),0.5,0))))))))-(IF((AC32=\"E\"),2,(IF((AC32=\"F\"),1,(IF((AC32=\"I\"),0.5,(IF((AC32=\"C\"),0.5,0)))))))))","v":" "},{"$f":"IF($C$15=MID(BA32,1,1),(P32+$O$15)*S32,0)+IF($C$15=MID(BA32,2,1),(M32+$O$15)*S32,0)+IF($C$15=MID(BA32,3,1),(P32+$O$15)*S32,0)+IF($C$15=MID(BA32,4,1),(M32+$O$15)*S32,0)","v":0},{"$f":"IF($C$16=MID(BA32,1,1),(P32+$O$16)*S32,0)+IF($C$16=MID(BA32,2,1),(M32+$O$16)*S32,0)+IF($C$16=MID(BA32,3,1),(P32+$O$16)*S32,0)+IF($C$16=MID(BA32,4,1),(M32+$O$16)*S32,0)","v":0},{"$f":"IF($C$17=MID(BA32,1,1),(P32+$O$17)*S32,0)+IF($C$17=MID(BA32,2,1),(M32+$O$17)*S32,0)+IF($C$17=MID(BA32,3,1),(P32+$O$17)*S32,0)+IF($C$17=MID(BA32,4,1),(M32+$O$17)*S32,0)","v":0},{"$f":"IF(ISBLANK(P32),CHAR(32),BB32+(IF((W32=\"E\"),$R$15,(IF((W32=\"F\"),$R$16,(IF((W32=\"I\"),$R$17,(IF((W32=\"C\"),0.5,0))))))))+(IF((Y32=\"E\"),$R$15,(IF((Y32=\"F\"),$R$16,(IF((Y32=\"I\"),$R$17,(IF((Y32=\"C\"),0.5,0)))))))))","v":" "},{"$f":"IF(ISBLANK(M32),CHAR(32),BC32+(IF((AA32=\"E\"),$R$15,(IF((AA32=\"F\"),$R$16,(IF((AA32=\"I\"),$R$17,(IF((AA32=\"C\"),0.5,0))))))))+(IF((AC32=\"E\"),$R$15,(IF((AC32=\"F\"),$R$16,(IF((AC32=\"I\"),$R$17,(IF((AC32=\"C\"),0.5,0)))))))))","v":" "}]
[null,null,11,null,null,null,null,null,null,null,null,null,null,null,null,null,null,null,null,null,null,null,null,null,null,null,null,null,null,null,null,null,null,null,null,null,null,null,null,null,null,null,null,null,null,null,null,null,null,null,null,null,""," "," ",0,0,0," "," "]
[null,null,12,null,null,null,null,null,null,null,null,null,null,null,null,null,null,null,null,null,null,null,null,null,null,null,null,null,null,null,null,null,null,null,null,null,null,null,null,null,null,null,null,null,null,null,null,null,null,null,null,null,""," "," ",0,0,0," "," "]
[null,null,13,null,null,null,null,null,null,null,null,null,null,null,null,null,null,null,null,null,null,null,null,null,null,null,null,null,null,null,null,null,null,null,null,null,null,null,null,null,null,null,null,null,null,null,null,null,null,null,null,null,""," "," ",0,0,0," "," "]
[null,null,14,null,null,null,null,null,null,null,null,null,null,null,null,null,null,null,null,null,null,null,null,null,null,null,null,null,null,null,null,null,null,null,null,null,null,null,null,null,null,null,null,null,null,null,null,null,null,null,null,null,""," "," ",0,0,0," "," "]
[null,null,15,null,null,null,null,null,null,null,null,null,null,null,null,null,null,null,null,null,null,null,null,null,null,null,null,null,null,null,null,null,null,null,null,null,null,null,null,null,null,null,null,null,null,null,null,null,null,null,null,null,""," "," ",0,0,0," "," "]
[null,null,16,null,null,null,null,null,null,null,null,null,null,null,null,null,null,null,null,null,null,null,null,null,null,null,null,null,null,null,null,null,null,null,null,null,null,null,null,null,null,null,null,null,null,null,null,null,null,null,null,null,""," "," ",0,0,0," "," "]
[null,null,17,null,null,null,null,null,null,null,null,null,null,null,null,null,null,null,null,null,null,null,null,null,null,null,null,null,null,null,null,null,null,null,null,null,null,null,null,null,null,null,null,null,null,null,null,null,null,null,null,null,""," "," ",0,0,0," "," "]
[null,null,18,null,null,null,null,null,null,null,null,null,null,null,null,null,null,null,null,null,null,null,null,null,null,null,null,null,null,null,null,null,null,null,null,null,null,null,null,null,null,null,null,null,null,null,null,null,null,null,null,null,""," "," ",0,0,0," "," "]
[null,null,19,null,null,null,null,null,null,null,null,null,null,null,null,null,null,null,null,null,null,null,null,null,null,null,null,null,null,null,null,null,null,null,null,null,null,null,null,null,null,null,null,null,null,null,null,null,null,null,null,null,""," "," ",0,0,0," "," "]
[null,null,20,null,null,null,null,null,null,null,null,null,null,null,null,null,null,null,null,null,null,null,null,null,null,null,null,null,null,null,null,null,null,null,null,null,null,null,null,null,null,null,null,null,null,null,null,null,null,null,null,null,""," "," ",0,0,0," "," "]
[null,null,21,null,null,null,null,null,null,null,null,null,null,null,null,null,null,null,null,null,null,null,null,null,null,null,null,null,null,null,null,null,null,null,null,null,null,null,null,null,null,null,null,null,null,null,null,null,null,null,null,null,""," "," ",0,0,0," "," "]
[null,null,22,null,null,null,null,null,null,null,null,null,null,null,null,null,null,null,null,null,null,null,null,null,null,null,null,null,null,null,null,null,null,null,null,null,null,null,null,null,null,null,null,null,null,null,null,null,null,null,null,null,""," "," ",0,0,0," "," "]
[null,null,23,null,null,null,null,null,null,null,null,null,null,null,null,null,null,null,null,null,null,null,null,null,null,null,null,null,null,null,null,null,null,null,null,null,null,null,null,null,null,null,null,null,null,null,null,null,null,null,null,null,""," "," ",0,0,0," "," "]
[null,null,24,null,null,null,null,null,null,null,null,null,null,null,null,null,null,null,null,null,null,null,null,null,null,null,null,null,null,null,null,null,null,null,null,null,null,null,null,null,null,null,null,null,null,null,null,null,null,null,null,null,""," "," ",0,0,0," "," "]
[null,null,25,null,null,null,null,null,null,null,null,null,null,null,null,null,null,null,null,null,null,null,null,null,null,null,null,null,null,null,null,null,null,null,null,null,null,null,null,null,null,null,null,null,null,null,null,null,null,null,null,null,""," "," ",0,0,0," "," "]
[null,null,26,null,null,null,null,null,null,null,null,null,null,null,null,null,null,null,null,null,null,null,null,null,null,null,null,null,null,null,null,null,null,null,null,null,null,null,null,null,null,null,null,null,null,null,null,null,null,null,null,null,""," "," ",0,0,0," "," "]
[null,null,27,null,null,null,null,null,null,null,null,null,null,null,null,null,null,null,null,null,null,null,null,null,null,null,null,null,null,null,null,null,null,null,null,null,null,null,null,null,null,null,null,null,null,null,null,null,null,null,null,null,""," "," ",0,0,0," "," "]
[null,null,28,null,null,null,null,null,null,null,null,null,null,null,null,null,null,null,null,null,null,null,null,null,null,null,null,null,null,null,null,null,null,null,null,null,null,null,null,null,null,null,null,null,null,null,null,null,null,null,null,null,""," "," ",0,0,0," "," "]
[null,null,29,null,null,null,null,null,null,null,null,null,null,null,null,null,null,null,null,null,null,null,null,null,null,null,null,null,null,null,null,null,null,null,null,null,null,null,null,null,null,null,null,null,null,null,null,null,null,null,null,null,""," "," ",0,0,0," "," "]
[null,null,30,null,null,null,null,null,null,null,null,null,null,null,null,null,null,null,null,null,null,null,null,null,null,null,null,null,null,null,null,null,null,null,null,null,null,null,null,null,null,null,null,null,null,null,null,null,null,null,null,null,""," "," ",0,0,0," "," "]
[null,null,31,null,null,null,null,null,null,null,null,null,null,null,null,null,null,null,null,null,null,null,null,null,null,null,null,null,null,null,null,null,null,null,null,null,null,null,null,null,null,null,null,null,null,null,null,null,null,null,null,null,""," "," ",0,0,0," "," "]
[null,null,32,null,null,null,null,null,null,null,null,null,null,null,null,null,null,null,null,null,null,null,null,null,null,null,null,null,null,null,null,null,null,null,null,null,null,null,null,null,null,null,null,null,null,null,null,null,null,null,null,null,""," "," ",0,0,0," "," "]
[null,null,33,null,null,null,null,null,null,null,null,null,null,null,null,null,null,null,null,null,null,null,null,null,null,null,null,null,null,null,null,null,null,null,null,null,null,null,null,null,null,null,null,null,null,null,null,null,null,null,null,null,""," "," ",0,0,0," "," "]
[null,null,34,null,null,null,null,null,null,null,null,null,null,null,null,null,null,null,null,null,null,null,null,null,null,null,null,null,null,null,null,null,null,null,null,null,null,null,null,null,null,null,null,null,null,null,null,null,null,null,null,null,""," "," ",0,0,0," "," "]
[null,null,35,null,null,null,null,null,null,null,null,null,null,null,null,null,null,null,null,null,null,null,null,null,null,null,null,null,null,null,null,null,null,null,null,null,null,null,null,null,null,null,null,null,null,null,null,null,null,null,null,null,""," "," ",0,0,0," "," "]
[null,null,36,null,null,null,null,null,null,null,null,null,null,null,null,null,null,null,null,null,null,null,null,null,null,null,null,null,null,null,null,null,null,null,null,null,null,null,null,null,null,null,null,null,null,null,null,null,null,null,null,null,""," "," ",0,0,0," "," "]
[null,null,37,null,null,null,null,null,null,null,null,null,null,null,null,null,null,null,null,null,null,null,null,null,null,null,null,null,null,null,null,null,null,null,null,null,null,null,null,null,null,null,null,null,null,null,null,null,null,null,null,null,""," "," ",0,0,0," "," "]
[null,null,38,null,null,null,null,null,null,null,null,null,null,null,null,null,null,null,null,null,null,null,null,null,null,null,null,null,null,null,null,null,null,null,null,null,null,null,null,null,null,null,null,null,null,null,null,null,null,null,null,null,""," "," ",0,0,0," "," "]
[null,null,39,null,null,null,null,null,null,null,null,null,null,null,null,null,null,null,null,null,null,null,null,null,null,null,null,null,null,null,null,null,null,null,null,null,null,null,null,null,null,null,null,null,null,null,null,null,null,null,null,null,""," "," ",0,0,0," "," "]
[null,null,40,null,null,null,null,null,null,null,null,null,null,null,null,null,null,null,null,null,null,null,null,null,null,null,null,null,null,null,null,null,null,null,null,null,null,null,null,null,null,null,null,null,null,null,null,null,null,null,null,null,""," "," ",0,0,0," "," "]
[null,null,41,null,null,null,null,null,null,null,null,null,null,null,null,null,null,null,null,null,null,null,null,null,null,null,null,null,null,null,null,null,null,null,null,null,null,null,null,null,null,null,null,null,null,null,null,null,null,null,null,null,""," "," ",0,0,0," "," "]
[null,null,42,null,null,null,null,null,null,null,null,null,null,null,null,null,null,null,null,null,null,null,null,null,null,null,null,null,null,null,null,null,null,null,null,null,null,null,null,null,null,null,null,null,null,null,null,null,null,null,null,null,""," "," ",0,0,0," "," "]
[null,null,43,null,null,null,null,null,null,null,null,null,null,null,null,null,null,null,null,null,null,null,null,null,null,null,null,null,null,null,null,null,null,null,null,null,null,null,null,null,null,null,null,null,null,null,null,null,null,null,null,null,""," "," ",0,0,0," "," "]
[null,null,44,null,null,null,null,null,null,null,null,null,null,null,null,null,null,null,null,null,null,null,null,null,null,null,null,null,null,null,null,null,null,null,null,null,null,null,null,null,null,null,null,null,null,null,null,null,null,null,null,null,""," "," ",0,0,0," "," "]
[null,null,45,null,null,null,null,null,null,null,null,null,null,null,null,null,null,null,null,null,null,null,null,null,null,null,null,null,null,null,null,null,null,null,null,null,null,null,null,null,null,null,null,null,null,null,null,null,null,null,null,null,""," "," ",0,0,0," "," "]
[null,null,46,null,null,null,null,null,null,null,null,null,null,null,null,null,null,null,null,null,null,null,null,null,null,null,null,null,null,null,null,null,null,null,null,null,null,null,null,null,null,null,null,null,null,null,null,null,null,null,null,null,""," "," ",0,0,0," "," "]
[null,null,47,null,null,null,null,null,null,null,null,null,null,null,null,null,null,null,null,null,null,null,null,null,null,null,null,null,null,null,null,null,null,null,null,null,null,null,null,null,null,null,null,null,null,null,null,null,null,null,null,null,""," "," ",0,0,0," "," "]
[null,null,48,null,null,null,null,null,null,null,null,null,null,null,null,null,null,null,null,null,null,null,null,null,null,null,null,null,null,null,null,null,null,null,null,null,null,null,null,null,null,null,null,null,null,null,null,null,null,null,null,null,""," "," ",0,0,0," "," "]
[null,null,49,null,null,null,null,null,null,null,null,null,null,null,null,null,null,null,null,null,null,null,null,null,null,null,null,null,null,null,null,null,null,null,null,null,null,null,null,null,null,null,null,null,null,null,null,null,null,null,null,null,""," "," ",0,0,0," "," "]
[null,null,50,null,null,null,null,null,null,null,null,null,null,null,null,null,null,null,null,null,null,null,null,null,null,null,null,null,null,null,null,null,null,null,null,null,null,null,null,null,null,null,null,null,null,null,null,null,null,null,null,null,""," "," ",0,0,0," "," "]
[null,null,51,null,null,null,null,null,null,null,null,null,null,null,null,null,null,null,null,null,null,null,null,null,null,null,null,null,null,null,null,null,null,null,null,null,null,null,null,null,null,null,null,null,null,null,null,null,null,null,null,null,""," "," ",0,0,0," "," "]
[null,null,52,null,null,null,null,null,null,null,null,null,null,null,null,null,null,null,null,null,null,null,null,null,null,null,null,null,null,null,null,null,null,null,null,null,null,null,null,null,null,null,null,null,null,null,null,null,null,null,null,null,""," "," ",0,0,0," "," "]
[null,null,53,null,null,null,null,null,null,null,null,null,null,null,null,null,null,null,null,null,null,null,null,null,null,null,null,null,null,null,null,null,null,null,null,null,null,null,null,null,null,null,null,null,null,null,null,null,null,null,null,null,""," "," ",0,0,0," "," "]
[null,null,54,null,null,null,null,null,null,null,null,null,null,null,null,null,null,null,null,null,null,null,null,null,null,null,null,null,null,null,null,null,null,null,null,null,null,null,null,null,null,null,null,null,null,null,null,null,null,null,null,null,""," "," ",0,0,0," "," "]
[null,null,55,null,null,null,null,null,null,null,null,null,null,null,null,null,null,null,null,null,null,null,null,null,null,null,null,null,null,null,null,null,null,null,null,null,null,null,null,null,null,null,null,null,null,null,null,null,null,null,null,null,""," "," ",0,0,0," "," "]
[null,null,56,null,null,null,null,null,null,null,null,null,null,null,null,null,null,null,null,null,null,null,null,null,null,null,null,null,null,null,null,null,null,null,null,null,null,null,null,null,null,null,null,null,null,null,null,null,null,null,null,null,""," "," ",0,0,0," "," "]
[null,null,57,null,null,null,null,null,null,null,null,null,null,null,null,null,null,null,null,null,null,null,null,null,null,null,null,null,null,null,null,null,null,null,null,null,null,null,null,null,null,null,null,null,null,null,null,null,null,null,null,null,""," "," ",0,0,0," "," "]
[null,null,58,null,null,null,null,null,null,null,null,null,null,null,null,null,null,null,null,null,null,null,null,null,null,null,null,null,null,null,null,null,null,null,null,null,null,null,null,null,null,null,null,null,null,null,null,null,null,null,null,null,""," "," ",0,0,0," "," "]
[null,null,59,null,null,null,null,null,null,null,null,null,null,null,null,null,null,null,null,null,null,null,null,null,null,null,null,null,null,null,null,null,null,null,null,null,null,null,null,null,null,null,null,null,null,null,null,null,null,null,null,null,""," "," ",0,0,0," "," "]
[null,null,60,null,null,null,null,null,null,null,null,null,null,null,null,null,null,null,null,null,null,null,null,null,null,null,null,null,null,null,null,null,null,null,null,null,null,null,null,null,null,null,null,null,null,null,null,null,null,null,null,null,""," "," ",0,0,0," "," "]
[null,null,61,null,null,null,null,null,null,null,null,null,null,null,null,null,null,null,null,null,null,null,null,null,null,null,null,null,null,null,null,null,null,null,null,null,null,null,null,null,null,null,null,null,null,null,null,null,null,null,null,null,""," "," ",0,0,0," "," "]
[null,null,62,null,null,null,null,null,null,null,null,null,null,null,null,null,null,null,null,null,null,null,null,null,null,null,null,null,null,null,null,null,null,null,null,null,null,null,null,null,null,null,null,null,null,null,null,null,null,null,null,null,""," "," ",0,0,0," "," "]
[null,null,63,null,null,null,null,null,null,null,null,null,null,null,null,null,null,null,null,null,null,null,null,null,null,null,null,null,null,null,null,null,null,null,null,null,null,null,null,null,null,null,null,null,null,null,null,null,null,null,null,null,""," "," ",0,0,0," "," "]
[null,null,64,null,null,null,null,null,null,null,null,null,null,null,null,null,null,null,null,null,null,null,null,null,null,null,null,null,null,null,null,null,null,null,null,null,null,null,null,null,null,null,null,null,null,null,null,null,null,null,null,null,""," "," ",0,0,0," "," "]
[null,null,65,null,null,null,null,null,null,null,null,null,null,null,null,null,null,null,null,null,null,null,null,null,null,null,null,null,null,null,null,null,null,null,null,null,null,null,null,null,null,null,null,null,null,null,null,null,null,null,null,null,""," "," ",0,0,0," "," "]
[null,null,66,null,null,null,null,null,null,null,null,null,null,null,null,null,null,null,null,null,null,null,null,null,null,null,null,null,null,null,null,null,null,null,null,null,null,null,null,null,null,null,null,null,null,null,null,null,null,null,null,null,""," "," ",0,0,0," "," "]
[null,null,67,null,null,null,null,null,null,null,null,null,null,null,null,null,null,null,null,null,null,null,null,null,null,null,null,null,null,null,null,null,null,null,null,null,null,null,null,null,null,null,null,null,null,null,null,null,null,null,null,null,""," "," ",0,0,0," "," "]
[null,null,68,null,null,null,null,null,null,null,null,null,null,null,null,null,null,null,null,null,null,null,null,null,null,null,null,null,null,null,null,null,null,null,null,null,null,null,null,null,null,null,null,null,null,null,null,null,null,null,null,null,""," "," ",0,0,0," "," "]
[null,null,69,null,null,null,null,null,null,null,null,null,null,null,null,null,null,null,null,null,null,null,null,null,null,null,null,null,null,null,null,null,null,null,null,null,null,null,null,null,null,null,null,null,null,null,null,null,null,null,null,null,""," "," ",0,0,0," "," "]
[null,null,70,null,null,null,null,null,null,null,null,null,null,null,null,null,null,null,null,null,null,null,null,null,null,null,null,null,null,null,null,null,null,null,null,null,null,null,null,null,null,null,null,null,null,null,null,null,null,null,null,null,""," "," ",0,0,0," "," "]
[null,null,71,null,null,null,null,null,null,null,null,null,null,null,null,null,null,null,null,null,null,null,null,null,null,null,null,null,null,null,null,null,null,null,null,null,null,null,null,null,null,null,null,null,null,null,null,null,null,null,null,null,""," "," ",0,0,0," "," "]
[null,null,72,null,null,null,null,null,null,null,null,null,null,null,null,null,null,null,null,null,null,null,null,null,null,null,null,null,null,null,null,null,null,null,null,null,null,null,null,null,null,null,null,null,null,null,null,null,null,null,null,null,""," "," ",0,0,0," "," "]
[null,null,73,null,null,null,null,null,null,null,null,null,null,null,null,null,null,null,null,null,null,null,null,null,null,null,null,null,null,null,null,null,null,null,null,null,null,null,null,null,null,null,null,null,null,null,null,null,null,null,null,null,""," "," ",0,0,0," "," "]
[null,null,74,null,null,null,null,null,null,null,null,null,null,null,null,null,null,null,null,null,null,null,null,null,null,null,null,null,null,null,null,null,null,null,null,null,null,null,null,null,null,null,null,null,null,null,null,null,null,null,null,null,{"$f":"IF(P96=\"\",\"\",CONCATENATE(IF(AA96=\"\",\"N\",AA96),IF(Y96=\"\",\"N\",Y96),IF(AC96=\"\",\"N\",AC96),IF(W96=\"\",\"N\",W96)))","v":""},{"$f":"IF(ISBLANK(P96),CHAR(32),P96-(IF((W96=\"E\"),$I$15,(IF((W96=\"F\"),$I$16,(IF((W96=\"I\"),$I$17,(IF((W96=\"C\"),0.5,0))))))))-(IF((Y96=\"E\"),$I$15,(IF((Y96=\"F\"),$I$16,(IF((Y96=\"I\"),$I$17,(IF((Y96=\"C\"),0.5,0)))))))))","v":" "},{"$f":"IF(ISBLANK(M96),CHAR(32),M96-(IF((AA96=\"E\"),2,(IF((AA96=\"F\"),1,(IF((AA96=\"I\"),0.5,(IF((AA96=\"C\"),0.5,0))))))))-(IF((AC96=\"E\"),2,(IF((AC96=\"F\"),1,(IF((AC96=\"I\"),0.5,(IF((AC96=\"C\"),0.5,0)))))))))","v":" "},{"$f":"IF($C$15=MID(BA96,1,1),(P96+$O$15)*S96,0)+IF($C$15=MID(BA96,2,1),(M96+$O$15)*S96,0)+IF($C$15=MID(BA96,3,1),(P96+$O$15)*S96,0)+IF($C$15=MID(BA96,4,1),(M96+$O$15)*S96,0)","v":0},{"$f":"IF($C$16=MID(BA96,1,1),(P96+$O$16)*S96,0)+IF($C$16=MID(BA96,2,1),(M96+$O$16)*S96,0)+IF($C$16=MID(BA96,3,1),(P96+$O$16)*S96,0)+IF($C$16=MID(BA96,4,1),(M96+$O$16)*S96,0)","v":0},{"$f":"IF($C$17=MID(BA96,1,1),(P96+$O$17)*S96,0)+IF($C$17=MID(BA96,2,1),(M96+$O$17)*S96,0)+IF($C$17=MID(BA96,3,1),(P96+$O$17)*S96,0)+IF($C$17=MID(BA96,4,1),(M96+$O$17)*S96,0)","v":0},{"$f":"IF(ISBLANK(P96),CHAR(32),BB96+(IF((W96=\"E\"),$R$15,(IF((W96=\"F\"),$R$16,(IF((W96=\"I\"),$R$17,(IF((W96=\"C\"),0.5,0))))))))+(IF((Y96=\"E\"),$R$15,(IF((Y96=\"F\"),$R$16,(IF((Y96=\"I\"),$R$17,(IF((Y96=\"C\"),0.5,0)))))))))","v":" "},{"$f":"IF(ISBLANK(M96),CHAR(32),BC96+(IF((AA96=\"E\"),$R$15,(IF((AA96=\"F\"),$R$16,(IF((AA96=\"I\"),$R$17,(IF((AA96=\"C\"),0.5,0))))))))+(IF((AC96=\"E\"),$R$15,(IF((AC96=\"F\"),$R$16,(IF((AC96=\"I\"),$R$17,(IF((AC96=\"C\"),0.5,0)))))))))","v":" "}]
[null,null,75,null,null,null,null,null,null,null,null,null,null,null,null,null,null,null,null,null,null,null,null,null,null,null,null,null,null,null,null,null,null,null,null,null,null,null,null,null,null,null,null,null,null,null,null,null,null,null,null,null,""," "," ",0,0,0," "," "]
[null,null,76,null,null,null,null,null,null,null,null,null,null,null,null,null,null,null,null,null,null,null,null,null,null,null,null,null,null,null,null,null,null,null,null,null,null,null,null,null,null,null,null,null,null,null,null,null,null,null,null,null,""," "," ",0,0,0," "," "]
[null,null,77,null,null,null,null,null,null,null,null,null,null,null,null,null,null,null,null,null,null,null,null,null,null,null,null,null,null,null,null,null,null,null,null,null,null,null,null,null,null,null,null,null,null,null,null,null,null,null,null,null,""," "," ",0,0,0," "," "]
[null,null,78,null,null,null,null,null,null,null,null,null,null,null,null,null,null,null,null,null,null,null,null,null,null,null,null,null,null,null,null,null,null,null,null,null,null,null,null,null,null,null,null,null,null,null,null,null,null,null,null,null,""," "," ",0,0,0," "," "]
[null,null,79,null,null,null,null,null,null,null,null,null,null,null,null,null,null,null,null,null,null,null,null,null,null,null,null,null,null,null,null,null,null,null,null,null,null,null,null,null,null,null,null,null,null,null,null,null,null,null,null,null,""," "," ",0,0,0," "," "]
[null,null,80,null,null,null,null,null,null,null,null,null,null,null,null,null,null,null,null,null,null,null,null,null,null,null,null,null,null,null,null,null,null,null,null,null,null,null,null,null,null,null,null,null,null,null,null,null,null,null,null,null,""," "," ",0,0,0," "," "]
[null,null,81,null,null,null,null,null,null,null,null,null,null,null,null,null,null,null,null,null,null,null,null,null,null,null,null,null,null,null,null,null,null,null,null,null,null,null,null,null,null,null,null,null,null,null,null,null,null,null,null,null,""," "," ",0,0,0," "," "]
[null,null,82,null,null,null,null,null,null,null,null,null,null,null,null,null,null,null,null,null,null,null,null,null,null,null,null,null,null,null,null,null,null,null,null,null,null,null,null,null,null,null,null,null,null,null,null,null,null,null,null,null,""," "," ",0,0,0," "," "]
[null,null,83,null,null,null,null,null,null,null,null,null,null,null,null,null,null,null,null,null,null,null,null,null,null,null,null,null,null,null,null,null,null,null,null,null,null,null,null,null,null,null,null,null,null,null,null,null,null,null,null,null,""," "," ",0,0,0," "," "]
[null,null,84,null,null,null,null,null,null,null,null,null,null,null,null,null,null,null,null,null,null,null,null,null,null,null,null,null,null,null,null,null,null,null,null,null,null,null,null,null,null,null,null,null,null,null,null,null,null,null,null,null,""," "," ",0,0,0," "," "]
[null,null,85,null,null,null,null,null,null,null,null,null,null,null,null,null,null,null,null,null,null,null,null,null,null,null,null,null,null,null,null,null,null,null,null,null,null,null,null,null,null,null,null,null,null,null,null,null,null,null,null,null,""," "," ",0,0,0," "," "]
[null,null,86,null,null,null,null,null,null,null,null,null,null,null,null,null,null,null,null,null,null,null,null,null,null,null,null,null,null,null,null,null,null,null,null,null,null,null,null,null,null,null,null,null,null,null,null,null,null,null,null,null,""," "," ",0,0,0," "," "]
[null,null,87,null,null,null,null,null,null,null,null,null,null,null,null,null,null,null,null,null,null,null,null,null,null,null,null,null,null,null,null,null,null,null,null,null,null,null,null,null,null,null,null,null,null,null,null,null,null,null,null,null,""," "," ",0,0,0," "," "]
[null,null,88,null,null,null,null,null,null,null,null,null,null,null,null,null,null,null,null,null,null,null,null,null,null,null,null,null,null,null,null,null,null,null,null,null,null,null,null,null,null,null,null,null,null,null,null,null,null,null,null,null,""," "," ",0,0,0," "," "]
[null,null,89,null,null,null,null,null,null,null,null,null,null,null,null,null,null,null,null,null,null,null,null,null,null,null,null,null,null,null,null,null,null,null,null,null,null,null,null,null,null,null,null,null,null,null,null,null,null,null,null,null,""," "," ",0,0,0," "," "]
[null,null,90,null,null,null,null,null,null,null,null,null,null,null,null,null,null,null,null,null,null,null,null,null,null,null,null,null,null,null,null,null,null,null,null,null,null,null,null,null,null,null,null,null,null,null,null,null,null,null,null,null,""," "," ",0,0,0," "," "]
[null,null,91,null,null,null,null,null,null,null,null,null,null,null,null,null,null,null,null,null,null,null,null,null,null,null,null,null,null,null,null,null,null,null,null,null,null,null,null,null,null,null,null,null,null,null,null,null,null,null,null,null,""," "," ",0,0,0," "," "]
[null,null,92,null,null,null,null,null,null,null,null,null,null,null,null,null,null,null,null,null,null,null,null,null,null,null,null,null,null,null,null,null,null,null,null,null,null,null,null,null,null,null,null,null,null,null,null,null,null,null,null,null,""," "," ",0,0,0," "," "]
[null,null,93,null,null,null,null,null,null,null,null,null,null,null,null,null,null,null,null,null,null,null,null,null,null,null,null,null,null,null,null,null,null,null,null,null,null,null,null,null,null,null,null,null,null,null,null,null,null,null,null,null,""," "," ",0,0,0," "," "]
[null,null,94,null,null,null,null,null,null,null,null,null,null,null,null,null,null,null,null,null,null,null,null,null,null,null,null,null,null,null,null,null,null,null,null,null,null,null,null,null,null,null,null,null,null,null,null,null,null,null,null,null,""," "," ",0,0,0," "," "]
[null,null,95,null,null,null,null,null,null,null,null,null,null,null,null,null,null,null,null,null,null,null,null,null,null,null,null,null,null,null,null,null,null,null,null,null,null,null,null,null,null,null,null,null,null,null,null,null,null,null,null,null,""," "," ",0,0,0," "," "]
[null,null,96,null,null,null,null,null,null,null,null,null,null,null,null,null,null,null,null,null,null,null,null,null,null,null,null,null,null,null,null,null,null,null,null,null,null,null,null,null,null,null,null,null,null,null,null,null,null,null,null,null,""," "," ",0,0,0," "," "]
[null,null,97,null,null,null,null,null,null,null,null,null,null,null,null,null,null,null,null,null,null,null,null,null,null,null,null,null,null,null,null,null,null,null,null,null,null,null,null,null,null,null,null,null,null,null,null,null,null,null,null,null,""," "," ",0,0,0," "," "]
[null,null,98,null,null,null,null,null,null,null,null,null,null,null,null,null,null,null,null,null,null,null,null,null,null,null,null,null,null,null,null,null,null,null,null,null,null,null,null,null,null,null,null,null,null,null,null,null,null,null,null,null,""," "," ",0,0,0," "," "]
[null,null,99,null,null,null,null,null,null,null,null,null,null,null,null,null,null,null,null,null,null,null,null,null,null,null,null,null,null,null,null,null,null,null,null,null,null,null,null,null,null,null,null,null,null,null,null,null,null,null,null,null,""," "," ",0,0,0," "," "]
[null,null,null,null,null,null,null,null,null,null,null,null,null,null,null,null,null,null,null,null,null,null,null,null,null,null,null,null,null,null,null,null,null,null,null,null,null,null,null,null,null,null,null,null,null,null,null,null,null,null,null,null,""," "," ",0,0,0," "," "]
[null,null,null,null,null,null,null,null,null,null,null,null,null,null,null,null,null,null,null,null,null,null,null,null,null,null,null,null,null,null,null,null,null,null,null,null,null,null,null,null,null,null,null,null,null,null,null,null,null,null,null,null,{"$f":"IF(P123=\"\",\"\",CONCATENATE(IF(AA123=\"\",\"N\",AA123),IF(Y123=\"\",\"N\",Y123),IF(AC123=\"\",\"N\",AC123),IF(W123=\"\",\"N\",W123)))","v":""},{"$f":"IF(ISBLANK(P123),CHAR(32),P123-(IF((W123=\"E\"),$I$15,(IF((W123=\"F\"),$I$16,(IF((W123=\"I\"),$I$17,(IF((W123=\"C\"),0.5,0))))))))-(IF((Y123=\"E\"),$I$15,(IF((Y123=\"F\"),$I$16,(IF((Y123=\"I\"),$I$17,(IF((Y123=\"C\"),0.5,0)))))))))","v":" "},{"$f":"IF(ISBLANK(M123),CHAR(32),M123-(IF((AA123=\"E\"),2,(IF((AA123=\"F\"),1,(IF((AA123=\"I\"),0.5,(IF((AA123=\"C\"),0.5,0))))))))-(IF((AC123=\"E\"),2,(IF((AC123=\"F\"),1,(IF((AC123=\"I\"),0.5,(IF((AC123=\"C\"),0.5,0)))))))))","v":" "},{"$f":"IF($C$15=MID(BA123,1,1),(P123+$O$15)*S123,0)+IF($C$15=MID(BA123,2,1),(M123+$O$15)*S123,0)+IF($C$15=MID(BA123,3,1),(P123+$O$15)*S123,0)+IF($C$15=MID(BA123,4,1),(M123+$O$15)*S123,0)","v":0},{"$f":"IF($C$16=MID(BA123,1,1),(P123+$O$16)*S123,0)+IF($C$16=MID(BA123,2,1),(M123+$O$16)*S123,0)+IF($C$16=MID(BA123,3,1),(P123+$O$16)*S123,0)+IF($C$16=MID(BA123,4,1),(M123+$O$16)*S123,0)","v":0},{"$f":"IF($C$17=MID(BA123,1,1),(P123+$O$17)*S123,0)+IF($C$17=MID(BA123,2,1),(M123+$O$17)*S123,0)+IF($C$17=MID(BA123,3,1),(P123+$O$17)*S123,0)+IF($C$17=MID(BA123,4,1),(M123+$O$17)*S123,0)","v":0},{"$f":"IF(ISBLANK(P123),CHAR(32),BB123+(IF((W123=\"E\"),$R$15,(IF((W123=\"F\"),$R$16,(IF((W123=\"I\"),$R$17,(IF((W123=\"C\"),0.5,0))))))))+(IF((Y123=\"E\"),$R$15,(IF((Y123=\"F\"),$R$16,(IF((Y123=\"I\"),$R$17,(IF((Y123=\"C\"),0.5,0)))))))))","v":" "},{"$f":"IF(ISBLANK(M123),CHAR(32),BC123+(IF((AA123=\"E\"),$R$15,(IF((AA123=\"F\"),$R$16,(IF((AA123=\"I\"),$R$17,(IF((AA123=\"C\"),0.5,0))))))))+(IF((AC123=\"E\"),$R$15,(IF((AC123=\"F\"),$R$16,(IF((AC123=\"I\"),$R$17,(IF((AC123=\"C\"),0.5,0)))))))))","v":" "}]
[null,null,null,null,null,null,null,null,null,null,null,null,null,null,null,null,null,null,null,null,null,null,null,null,null,null,null,null,null,null,null,null,null,null,null,null,null,null,null,null,null,null,null,null,null,null,null,null,null,null,null,null,""," "," ",0,0,0," "," "]
[null,null,null,null,null,null,null,null,null,null,null,null,null,null,null,null,null,null,null,null,null,null,null,null,null,null,null,null,null,null,null,null,null,null,null,null,null,null,null,null,null,null,null,null,null,null,null,null,null,null,null,null,""," "," ",0,0,0," "," "]

{"sheet":"Nastavení","index":1,"n_rows":6,"n_cols":2,"rows_kept":6,"cut":false,"hidden":false,"merged":[]}
["Jednotky:","MM"]
[]
[]
[]
["Výběr:",1]
[null,0]

{"sheet":"CADImport","index":2,"n_rows":125,"n_cols":16,"rows_kept":125,"cut":false,"hidden":false,"merged":[[0,0,0,14],[1,0,1,14],[2,0,2,14],[3,0,3,14],[4,0,4,14]]}
[{"$f":"CONCATENATE(\"^Job    :  \",CLEAN(Zakázka!I7))","v":"^Job    :  ZAV-TAS príklad vyplnenia porezu"}]
[{"$f":"CONCATENATE(\"^Description    :  \",Zakázka!I8)","v":"^Description    :  Kuchyňa"}]
[{"$f":"CONCATENATE(\"^Date    :  \",TEXT(Zakázka!I9,\"dd.m. (hh:mm)\"))","v":"^Date    :  09.3. (16:33)"}]
[{"$f":"CONCATENATE(\"^Parts    :  \",COUNTIF(Zakázka!E23:'Zakázka'!E122,\"*\"))","v":"^Parts    :  4"}]
[{"$f":"CONCATENATE(\"^Unit    :  \",\"MM\")","v":"^Unit    :  MM"}]
["Banding",{"$f":"IF(ISBLANK(Zakázka!C15),CHAR(32),Zakázka!C15)","v":"E"},{"$f":"IF(ISBLANK(Zakázka!$I$13),\" \",Zakázka!$I$13 & IFERROR(\" \" & VLOOKUP($B6,Zakázka!$C$15:$K$18,7,0),\"\"))","v":"H1180 egger 2"},null,{"$f":"Zakázka!I15","v":2}]
["Banding",{"$f":"IF(ISBLANK(Zakázka!C16),CHAR(32),Zakázka!C16)","v":"F"},{"$f":"IF(ISBLANK(Zakázka!$I$13),\" \",Zakázka!$I$13 & IFERROR(\" \" & VLOOKUP($B7,Zakázka!$C$15:$K$18,7,0),\"\"))","v":"H1180 egger 1"},null,{"$f":"Zakázka!I16","v":1}]
["Banding",{"$f":"IF(ISBLANK(Zakázka!C17),CHAR(32),Zakázka!C17)","v":"I"},{"$f":"IF(ISBLANK(Zakázka!$I$13),\" \",Zakázka!$I$13 & IFERROR(\" \" & VLOOKUP($B8,Zakázka!$C$15:$K$18,7,0),\"\"))","v":"H1180 egger 0.5"},null,{"$f":"Zakázka!I17","v":0.5},null,null,null,null,null,null,null,null,null,{"$f":"CHAR(32)","v":" "}," "]
["Banding","C",{"$f":"IF(ISBLANK(Zakázka!$I$13),\" \",Zakázka!$I$13 & IFERROR(\" \" & VLOOKUP($B9,Zakázka!$C$15:$K$18,7,0),\"\"))","v":"H1180 egger"},null,{"$f":"Zakázka!I17","v":0.5}]
[{"$f":"IF(ISBLANK(Zakázka!E23),CHAR(94),IF(ISTEXT(Zakázka!E23),CHAR(32),Zakázka!E23))","v":" "},{"$f":"IF(ISBLANK(Zakázka!E23),CHAR(32),Zakázka!E23)","v":"bok"},{"$f":"IF(ISBLANK(Zakázka!BG23),CHAR(32),Zakázka!BG23)","v":399},{"$f":"IF(ISBLANK(Zakázka!BH23),CHAR(32),Zakázka!BH23)","v":798},{"$f":"IF(ISBLANK(Zakázka!E23),CHAR(32),Zakázka!$I$11)","v":"18"},{"$f":"IF(ISBLANK(Zakázka!E23),CHAR(32),Zakázka!$I$10)","v":"H1180 egger"},{"$f":"IF(ISBLANK(Zakázka!U23),CHAR(32),Zakázka!U23)","v":1},{"$f":"IF(ISBLANK(Zakázka!S23),CHAR(32),Zakázka!S23)","v":1},{"$f":"IF(ISBLANK(Zakázka!E23),CHAR(32),(Zakázka!$I$12))","v":1}," "," ",{"$f":"IF(ISBLANK(Zakázka!BA23),CHAR(32),Zakázka!BA23)","v":"FNFF"}]
[{"$f":"IF(ISBLANK(Zakázka!E24),CHAR(94),IF(ISTEXT(Zakázka!E24),CHAR(32),Zakázka!E24))","v":" "},{"$f":"IF(ISBLANK(Zakázka!E24),CHAR(32),Zakázka!E24)","v":"dno"},{"$f":"IF(ISBLANK(Zakázka!BG24),CHAR(32),Zakázka!BG24)","v":399},{"$f":"IF(ISBLANK(Zakázka!BH24),CHAR(32),Zakázka!BH24)","v":600},{"$f":"IF(ISBLANK(Zakázka!E24),CHAR(32),Zakázka!$I$11)","v":"18"},{"$f":"IF(ISBLANK(Zakázka!E24),CHAR(32),Zakázka!$I$10)","v":"H1180 egger"},{"$f":"IF(ISBLANK(Zakázka!U24),CHAR(32),Zakázka!U24)","v":1},{"$f":"IF(ISBLANK(Zakázka!S24),CHAR(32),Zakázka!S24)","v":1},{"$f":"IF(ISBLANK(Zakázka!E24),CHAR(32),(Zakázka!$I$12))","v":1}," "," ",{"$f":"IF(ISBLANK(Zakázka!BA24),CHAR(32),Zakázka!BA24)","v":"NNNF"}]
[{"$f":"IF(ISBLANK(Zakázka!E25),CHAR(94),IF(ISTEXT(Zakázka!E25),CHAR(32),Zakázka!E25))","v":" "},{"$f":"IF(ISBLANK(Zakázka!E25),CHAR(32),Zakázka!E25)","v":"medzistena"},{"$f":"IF(ISBLANK(Zakázka!BG25),CHAR(32),Zakázka!BG25)","v":599.5},{"$f":"IF(ISBLANK(Zakázka!BH25),CHAR(32),Zakázka!BH25)","v":400},{"$f":"IF(ISBLANK(Zakázka!E25),CHAR(32),Zakázka!$I$11)","v":"18"},{"$f":"IF(ISBLANK(Zakázka!E25),CHAR(32),Zakázka!$I$10)","v":"H1180 egger"},{"$f":"IF(ISBLANK(Zakázka!U25),CHAR(32),Zakázka!U25)","v":1},{"$f":"IF(ISBLANK(Zakázka!S25),CHAR(32),Zakázka!S25)","v":1},{"$f":"IF(ISBLANK(Zakázka!E25),CHAR(32),(Zakázka!$I$12))","v":1}," "," ",{"$f":"IF(ISBLANK(Zakázka!BA25),CHAR(32),Zakázka!BA25)","v":"NNNI"}]
[{"$f":"IF(ISBLANK(Zakázka!E26),CHAR(94),IF(ISTEXT(Zakázka!E26),CHAR(32),Zakázka!E26))","v":" "},{"$f":"IF(ISBLANK(Zakázka!E26),CHAR(32),Zakázka!E26)","v":"medzistena"},{"$f":"IF(ISBLANK(Zakázka!BG26),CHAR(32),Zakázka!BG26)","v":798},{"$f":"IF(ISBLANK(Zakázka!BH26),CHAR(32),Zakázka!BH26)","v":500},{"$f":"IF(ISBLANK(Zakázka!E26),CHAR(32),Zakázka!$I$11)","v":"18"},{"$f":"IF(ISBLANK(Zakázka!E26),CHAR(32),Zakázka!$I$10)","v":"H1180 egger"},{"$f":"IF(ISBLANK(Zakázka!U26),CHAR(32),Zakázka!U26)","v":1},{"$f":"IF(ISBLANK(Zakázka!S26),CHAR(32),Zakázka!S26)","v":1},{"$f":"IF(ISBLANK(Zakázka!E26),CHAR(32),(Zakázka!$I$12))","v":1}," "," ",{"$f":"IF(ISBLANK(Zakázka!BA26),CHAR(32),Zakázka!BA26)","v":"NNNE"}]
[{"$f":"IF(ISBLANK(Zakázka!E27),CHAR(94),IF(ISTEXT(Zakázka!E27),CHAR(32),Zakázka!E27))","v":"^"},{"$f":"IF(ISBLANK(Zakázka!E27),CHAR(32),Zakázka!E27)","v":" "},{"$f":"IF(ISBLANK(Zakázka!BG27),CHAR(32),Zakázka!BG27)","v":" "},{"$f":"IF(ISBLANK(Zakázka!BH27),CHAR(32),Zakázka!BH27)","v":" "},{"$f":"IF(ISBLANK(Zakázka!E27),CHAR(32),Zakázka!$I$11)","v":" "},{"$f":"IF(ISBLANK(Zakázka!E27),CHAR(32),Zakázka!$I$10)","v":" "},{"$f":"IF(ISBLANK(Zakázka!U27),CHAR(32),Zakázka!U27)","v":" "},{"$f":"IF(ISBLANK(Zakázka!S27),CHAR(32),Zakázka!S27)","v":" "},{"$f":"IF(ISBLANK(Zakázka!E27),CHAR(32),(Zakázka!$I$12))","v":" "}," "," ",{"$f":"IF(ISBLANK(Zakázka!BA27),CHAR(32),Zakázka!BA27)","v":""}]
[{"$f":"IF(ISBLANK(Zakázka!E28),CHAR(94),IF(ISTEXT(Zakázka!E28),CHAR(32),Zakázka!E28))","v":"^"},{"$f":"IF(ISBLANK(Zakázka!E28),CHAR(32),Zakázka!E28)","v":" "},{"$f":"IF(ISBLANK(Zakázka!BG28),CHAR(32),Zakázka!BG28)","v":" "},{"$f":"IF(ISBLANK(Zakázka!BH28),CHAR(32),Zakázka!BH28)","v":" "},{"$f":"IF(ISBLANK(Zakázka!E28),CHAR(32),Zakázka!$I$11)","v":" "},{"$f":"IF(ISBLANK(Zakázka!E28),CHAR(32),Zakázka!$I$10)","v":" "},{"$f":"IF(ISBLANK(Zakázka!U28),CHAR(32),Zakázka!U28)","v":" "},{"$f":"IF(ISBLANK(Zakázka!S28),CHAR(32),Zakázka!S28)","v":" "},{"$f":"IF(ISBLANK(Zakázka!E28),CHAR(32),(Zakázka!$I$12))","v":" "}," "," ",{"$f":"IF(ISBLANK(Zakázka!BA28),CHAR(32),Zakázka!BA28)","v":""}]
[{"$f":"IF(ISBLANK(Zakázka!E29),CHAR(94),IF(ISTEXT(Zakázka!E29),CHAR(32),Zakázka!E29))","v":"^"},{"$f":"IF(ISBLANK(Zakázka!E29),CHAR(32),Zakázka!E29)","v":" "},{"$f":"IF(ISBLANK(Zakázka!BG29),CHAR(32),Zakázka!BG29)","v":" "},{"$f":"IF(ISBLANK(Zakázka!BH29),CHAR(32),Zakázka!BH29)","v":" "},{"$f":"IF(ISBLANK(Zakázka!E29),CHAR(32),Zakázka!$I$11)","v":" "},{"$f":"IF(ISBLANK(Zakázka!E29),CHAR(32),Zakázka!$I$10)","v":" "},{"$f":"IF(ISBLANK(Zakázka!U29),CHAR(32),Zakázka!U29)","v":" "},{"$f":"IF(ISBLANK(Zakázka!S29),CHAR(32),Zakázka!S29)","v":" "},{"$f":"IF(ISBLANK(Zakázka!E29),CHAR(32),(Zakázka!$I$12))","v":" "}," "," ",{"$f":"IF(ISBLANK(Zakázka!BA29),CHAR(32),Zakázka!BA29)","v":""}]
[{"$f":"IF(ISBLANK(Zakázka!E30),CHAR(94),IF(ISTEXT(Zakázka!E30),CHAR(32),Zakázka!E30))","v":"^"},{"$f":"IF(ISBLANK(Zakázka!E30),CHAR(32),Zakázka!E30)","v":" "},{"$f":"IF(ISBLANK(Zakázka!BG30),CHAR(32),Zakázka!BG30)","v":" "},{"$f":"IF(ISBLANK(Zakázka!BH30),CHAR(32),Zakázka!BH30)","v":" "},{"$f":"IF(ISBLANK(Zakázka!E30),CHAR(32),Zakázka!$I$11)","v":" "},{"$f":"IF(ISBLANK(Zakázka!E30),CHAR(32),Zakázka!$I$10)","v":" "},{"$f":"IF(ISBLANK(Zakázka!U30),CHAR(32),Zakázka!U30)","v":" "},{"$f":"IF(ISBLANK(Zakázka!S30),CHAR(32),Zakázka!S30)","v":" "},{"$f":"IF(ISBLANK(Zakázka!E30),CHAR(32),(Zakázka!$I$12))","v":" "}," "," ",{"$f":"IF(ISBLANK(Zakázka!BA30),CHAR(32),Zakázka!BA30)","v":""}]
[{"$f":"IF(ISBLANK(Zakázka!E31),CHAR(94),IF(ISTEXT(Zakázka!E31),CHAR(32),Zakázka!E31))","v":"^"},{"$f":"IF(ISBLANK(Zakázka!E31),CHAR(32),Zakázka!E31)","v":" "},{"$f":"IF(ISBLANK(Zakázka!BG31),CHAR(32),Zakázka!BG31)","v":" "},{"$f":"IF(ISBLANK(Zakázka!BH31),CHAR(32),Zakázka!BH31)","v":" "},{"$f":"IF(ISBLANK(Zakázka!E31),CHAR(32),Zakázka!$I$11)","v":" "},{"$f":"IF(ISBLANK(Zakázka!E31),CHAR(32),Zakázka!$I$10)","v":" "},{"$f":"IF(ISBLANK(Zakázka!U31),CHAR(32),Zakázka!U31)","v":" "},{"$f":"IF(ISBLANK(Zakázka!S31),CHAR(32),Zakázka!S31)","v":" "},{"$f":"IF(ISBLANK(Zakázka!E31),CHAR(32),(Zakázka!$I$12))","v":" "}," "," ",{"$f":"IF(ISBLANK(Zakázka!BA31),CHAR(32),Zakázka!BA31)","v":""}]
[{"$f":"IF(ISBLANK(Zakázka!E32),CHAR(94),IF(ISTEXT(Zakázka!E32),CHAR(32),Zakázka!E32))","v":"^"},{"$f":"IF(ISBLANK(Zakázka!E32),CHAR(32),Zakázka!E32)","v":" "},{"$f":"IF(ISBLANK(Zakázka!BG32),CHAR(32),Zakázka!BG32)","v":" "},{"$f":"IF(ISBLANK(Zakázka!BH32),CHAR(32),Zakázka!BH32)","v":" "},{"$f":"IF(ISBLANK(Zakázka!E32),CHAR(32),Zakázka!$I$11)","v":" "},{"$f":"IF(ISBLANK(Zakázka!E32),CHAR(32),Zakázka!$I$10)","v":" "},{"$f":"IF(ISBLANK(Zakázka!U32),CHAR(32),Zakázka!U32)","v":" "},{"$f":"IF(ISBLANK(Zakázka!S32),CHAR(32),Zakázka!S32)","v":" "},{"$f":"IF(ISBLANK(Zakázka!E32),CHAR(32),(Zakázka!$I$12))","v":" "}," "," ",{"$f":"IF(ISBLANK(Zakázka!BA32),CHAR(32),Zakázka!BA32)","v":""}]
[{"$f":"IF(ISBLANK(Zakázka!E33),CHAR(94),IF(ISTEXT(Zakázka!E33),CHAR(32),Zakázka!E33))","v":"^"},{"$f":"IF(ISBLANK(Zakázka!E33),CHAR(32),Zakázka!E33)","v":" "},{"$f":"IF(ISBLANK(Zakázka!BG33),CHAR(32),Zakázka!BG33)","v":" "},{"$f":"IF(ISBLANK(Zakázka!BH33),CHAR(32),Zakázka!BH33)","v":" "},{"$f":"IF(ISBLANK(Zakázka!E33),CHAR(32),Zakázka!$I$11)","v":" "},{"$f":"IF(ISBLANK(Zakázka!E33),CHAR(32),Zakázka!$I$10)","v":" "},{"$f":"IF(ISBLANK(Zakázka!U33),CHAR(32),Zakázka!U33)","v":" "},{"$f":"IF(ISBLANK(Zakázka!S33),CHAR(32),Zakázka!S33)","v":" "},{"$f":"IF(ISBLANK(Zakázka!E33),CHAR(32),(Zakázka!$I$12))","v":" "}," "," ",{"$f":"IF(ISBLANK(Zakázka!BA33),CHAR(32),Zakázka!BA33)","v":""}]
[{"$f":"IF(ISBLANK(Zakázka!E34),CHAR(94),IF(ISTEXT(Zakázka!E34),CHAR(32),Zakázka!E34))","v":"^"},{"$f":"IF(ISBLANK(Zakázka!E34),CHAR(32),Zakázka!E34)","v":" "},{"$f":"IF(ISBLANK(Zakázka!BG34),CHAR(32),Zakázka!BG34)","v":" "},{"$f":"IF(ISBLANK(Zakázka!BH34),CHAR(32),Zakázka!BH34)","v":" "},{"$f":"IF(ISBLANK(Zakázka!E34),CHAR(32),Zakázka!$I$11)","v":" "},{"$f":"IF(ISBLANK(Zakázka!E34),CHAR(32),Zakázka!$I$10)","v":" "},{"$f":"IF(ISBLANK(Zakázka!U34),CHAR(32),Zakázka!U34)","v":" "},{"$f":"IF(ISBLANK(Zakázka!S34),CHAR(32),Zakázka!S34)","v":" "},{"$f":"IF(ISBLANK(Zakázka!E34),CHAR(32),(Zakázka!$I$12))","v":" "}," "," ",{"$f":"IF(ISBLANK(Zakázka!BA34),CHAR(32),Zakázka!BA34)","v":""}]
[{"$f":"IF(ISBLANK(Zakázka!E35),CHAR(94),IF(ISTEXT(Zakázka!E35),CHAR(32),Zakázka!E35))","v":"^"},{"$f":"IF(ISBLANK(Zakázka!E35),CHAR(32),Zakázka!E35)","v":" "},{"$f":"IF(ISBLANK(Zakázka!BG35),CHAR(32),Zakázka!BG35)","v":" "},{"$f":"IF(ISBLANK(Zakázka!BH35),CHAR(32),Zakázka!BH35)","v":" "},{"$f":"IF(ISBLANK(Zakázka!E35),CHAR(32),Zakázka!$I$11)","v":" "},{"$f":"IF(ISBLANK(Zakázka!E35),CHAR(32),Zakázka!$I$10)","v":" "},{"$f":"IF(ISBLANK(Zakázka!U35),CHAR(32),Zakázka!U35)","v":" "},{"$f":"IF(ISBLANK(Zakázka!S35),CHAR(32),Zakázka!S35)","v":" "},{"$f":"IF(ISBLANK(Zakázka!E35),CHAR(32),(Zakázka!$I$12))","v":" "}," "," ",{"$f":"IF(ISBLANK(Zakázka!BA35),CHAR(32),Zakázka!BA35)","v":""}]
[{"$f":"IF(ISBLANK(Zakázka!E36),CHAR(94),IF(ISTEXT(Zakázka!E36),CHAR(32),Zakázka!E36))","v":"^"},{"$f":"IF(ISBLANK(Zakázka!E36),CHAR(32),Zakázka!E36)","v":" "},{"$f":"IF(ISBLANK(Zakázka!BG36),CHAR(32),Zakázka!BG36)","v":" "},{"$f":"IF(ISBLANK(Zakázka!BH36),CHAR(32),Zakázka!BH36)","v":" "},{"$f":"IF(ISBLANK(Zakázka!E36),CHAR(32),Zakázka!$I$11)","v":" "},{"$f":"IF(ISBLANK(Zakázka!E36),CHAR(32),Zakázka!$I$10)","v":" "},{"$f":"IF(ISBLANK(Zakázka!U36),CHAR(32),Zakázka!U36)","v":" "},{"$f":"IF(ISBLANK(Zakázka!S36),CHAR(32),Zakázka!S36)","v":" "},{"$f":"IF(ISBLANK(Zakázka!E36),CHAR(32),(Zakázka!$I$12))","v":" "}," "," ",{"$f":"IF(ISBLANK(Zakázka!BA36),CHAR(32),Zakázka!BA36)","v":""}]
[{"$f":"IF(ISBLANK(Zakázka!E37),CHAR(94),IF(ISTEXT(Zakázka!E37),CHAR(32),Zakázka!E37))","v":"^"},{"$f":"IF(ISBLANK(Zakázka!E37),CHAR(32),Zakázka!E37)","v":" "},{"$f":"IF(ISBLANK(Zakázka!BG37),CHAR(32),Zakázka!BG37)","v":" "},{"$f":"IF(ISBLANK(Zakázka!BH37),CHAR(32),Zakázka!BH37)","v":" "},{"$f":"IF(ISBLANK(Zakázka!E37),CHAR(32),Zakázka!$I$11)","v":" "},{"$f":"IF(ISBLANK(Zakázka!E37),CHAR(32),Zakázka!$I$10)","v":" "},{"$f":"IF(ISBLANK(Zakázka!U37),CHAR(32),Zakázka!U37)","v":" "},{"$f":"IF(ISBLANK(Zakázka!S37),CHAR(32),Zakázka!S37)","v":" "},{"$f":"IF(ISBLANK(Zakázka!E37),CHAR(32),(Zakázka!$I$12))","v":" "}," "," ",{"$f":"IF(ISBLANK(Zakázka!BA37),CHAR(32),Zakázka!BA37)","v":""}]
[{"$f":"IF(ISBLANK(Zakázka!E38),CHAR(94),IF(ISTEXT(Zakázka!E38),CHAR(32),Zakázka!E38))","v":"^"},{"$f":"IF(ISBLANK(Zakázka!E38),CHAR(32),Zakázka!E38)","v":" "},{"$f":"IF(ISBLANK(Zakázka!BG38),CHAR(32),Zakázka!BG38)","v":" "},{"$f":"IF(ISBLANK(Zakázka!BH38),CHAR(32),Zakázka!BH38)","v":" "},{"$f":"IF(ISBLANK(Zakázka!E38),CHAR(32),Zakázka!$I$11)","v":" "},{"$f":"IF(ISBLANK(Zakázka!E38),CHAR(32),Zakázka!$I$10)","v":" "},{"$f":"IF(ISBLANK(Zakázka!U38),CHAR(32),Zakázka!U38)","v":" "},{"$f":"IF(ISBLANK(Zakázka!S38),CHAR(32),Zakázka!S38)","v":" "},{"$f":"IF(ISBLANK(Zakázka!E38),CHAR(32),(Zakázka!$I$12))","v":" "}," "," ",{"$f":"IF(ISBLANK(Zakázka!BA38),CHAR(32),Zakázka!BA38)","v":""}]
[{"$f":"IF(ISBLANK(Zakázka!E39),CHAR(94),IF(ISTEXT(Zakázka!E39),CHAR(32),Zakázka!E39))","v":"^"},{"$f":"IF(ISBLANK(Zakázka!E39),CHAR(32),Zakázka!E39)","v":" "},{"$f":"IF(ISBLANK(Zakázka!BG39),CHAR(32),Zakázka!BG39)","v":" "},{"$f":"IF(ISBLANK(Zakázka!BH39),CHAR(32),Zakázka!BH39)","v":" "},{"$f":"IF(ISBLANK(Zakázka!E39),CHAR(32),Zakázka!$I$11)","v":" "},{"$f":"IF(ISBLANK(Zakázka!E39),CHAR(32),Zakázka!$I$10)","v":" "},{"$f":"IF(ISBLANK(Zakázka!U39),CHAR(32),Zakázka!U39)","v":" "},{"$f":"IF(ISBLANK(Zakázka!S39),CHAR(32),Zakázka!S39)","v":" "},{"$f":"IF(ISBLANK(Zakázka!E39),CHAR(32),(Zakázka!$I$12))","v":" "}," "," ",{"$f":"IF(ISBLANK(Zakázka!BA39),CHAR(32),Zakázka!BA39)","v":""}]
[{"$f":"IF(ISBLANK(Zakázka!E40),CHAR(94),IF(ISTEXT(Zakázka!E40),CHAR(32),Zakázka!E40))","v":"^"},{"$f":"IF(ISBLANK(Zakázka!E40),CHAR(32),Zakázka!E40)","v":" "},{"$f":"IF(ISBLANK(Zakázka!BG40),CHAR(32),Zakázka!BG40)","v":" "},{"$f":"IF(ISBLANK(Zakázka!BH40),CHAR(32),Zakázka!BH40)","v":" "},{"$f":"IF(ISBLANK(Zakázka!E40),CHAR(32),Zakázka!$I$11)","v":" "},{"$f":"IF(ISBLANK(Zakázka!E40),CHAR(32),Zakázka!$I$10)","v":" "},{"$f":"IF(ISBLANK(Zakázka!U40),CHAR(32),Zakázka!U40)","v":" "},{"$f":"IF(ISBLANK(Zakázka!S40),CHAR(32),Zakázka!S40)","v":" "},{"$f":"IF(ISBLANK(Zakázka!E40),CHAR(32),(Zakázka!$I$12))","v":" "}," "," ",{"$f":"IF(ISBLANK(Zakázka!BA40),CHAR(32),Zakázka!BA40)","v":""}]
[{"$f":"IF(ISBLANK(Zakázka!E41),CHAR(94),IF(ISTEXT(Zakázka!E41),CHAR(32),Zakázka!E41))","v":"^"},{"$f":"IF(ISBLANK(Zakázka!E41),CHAR(32),Zakázka!E41)","v":" "},{"$f":"IF(ISBLANK(Zakázka!BG41),CHAR(32),Zakázka!BG41)","v":" "},{"$f":"IF(ISBLANK(Zakázka!BH41),CHAR(32),Zakázka!BH41)","v":" "},{"$f":"IF(ISBLANK(Zakázka!E41),CHAR(32),Zakázka!$I$11)","v":" "},{"$f":"IF(ISBLANK(Zakázka!E41),CHAR(32),Zakázka!$I$10)","v":" "},{"$f":"IF(ISBLANK(Zakázka!U41),CHAR(32),Zakázka!U41)","v":" "},{"$f":"IF(ISBLANK(Zakázka!S41),CHAR(32),Zakázka!S41)","v":" "},{"$f":"IF(ISBLANK(Zakázka!E41),CHAR(32),(Zakázka!$I$12))","v":" "}," "," ",{"$f":"IF(ISBLANK(Zakázka!BA41),CHAR(32),Zakázka!BA41)","v":""}]
[{"$f":"IF(ISBLANK(Zakázka!E42),CHAR(94),IF(ISTEXT(Zakázka!E42),CHAR(32),Zakázka!E42))","v":"^"},{"$f":"IF(ISBLANK(Zakázka!E42),CHAR(32),Zakázka!E42)","v":" "},{"$f":"IF(ISBLANK(Zakázka!BG42),CHAR(32),Zakázka!BG42)","v":" "},{"$f":"IF(ISBLANK(Zakázka!BH42),CHAR(32),Zakázka!BH42)","v":" "},{"$f":"IF(ISBLANK(Zakázka!E42),CHAR(32),Zakázka!$I$11)","v":" "},{"$f":"IF(ISBLANK(Zakázka!E42),CHAR(32),Zakázka!$I$10)","v":" "},{"$f":"IF(ISBLANK(Zakázka!U42),CHAR(32),Zakázka!U42)","v":" "},{"$f":"IF(ISBLANK(Zakázka!S42),CHAR(32),Zakázka!S42)","v":" "},{"$f":"IF(ISBLANK(Zakázka!E42),CHAR(32),(Zakázka!$I$12))","v":" "}," "," ",{"$f":"IF(ISBLANK(Zakázka!BA42),CHAR(32),Zakázka!BA42)","v":""}]
[{"$f":"IF(ISBLANK(Zakázka!E43),CHAR(94),IF(ISTEXT(Zakázka!E43),CHAR(32),Zakázka!E43))","v":"^"},{"$f":"IF(ISBLANK(Zakázka!E43),CHAR(32),Zakázka!E43)","v":" "},{"$f":"IF(ISBLANK(Zakázka!BG43),CHAR(32),Zakázka!BG43)","v":" "},{"$f":"IF(ISBLANK(Zakázka!BH43),CHAR(32),Zakázka!BH43)","v":" "},{"$f":"IF(ISBLANK(Zakázka!E43),CHAR(32),Zakázka!$I$11)","v":" "},{"$f":"IF(ISBLANK(Zakázka!E43),CHAR(32),Zakázka!$I$10)","v":" "},{"$f":"IF(ISBLANK(Zakázka!U43),CHAR(32),Zakázka!U43)","v":" "},{"$f":"IF(ISBLANK(Zakázka!S43),CHAR(32),Zakázka!S43)","v":" "},{"$f":"IF(ISBLANK(Zakázka!E43),CHAR(32),(Zakázka!$I$12))","v":" "}," "," ",{"$f":"IF(ISBLANK(Zakázka!BA43),CHAR(32),Zakázka!BA43)","v":""}]
[{"$f":"IF(ISBLANK(Zakázka!E44),CHAR(94),IF(ISTEXT(Zakázka!E44),CHAR(32),Zakázka!E44))","v":"^"},{"$f":"IF(ISBLANK(Zakázka!E44),CHAR(32),Zakázka!E44)","v":" "},{"$f":"IF(ISBLANK(Zakázka!BG44),CHAR(32),Zakázka!BG44)","v":" "},{"$f":"IF(ISBLANK(Zakázka!BH44),CHAR(32),Zakázka!BH44)","v":" "},{"$f":"IF(ISBLANK(Zakázka!E44),CHAR(32),Zakázka!$I$11)","v":" "},{"$f":"IF(ISBLANK(Zakázka!E44),CHAR(32),Zakázka!$I$10)","v":" "},{"$f":"IF(ISBLANK(Zakázka!U44),CHAR(32),Zakázka!U44)","v":" "},{"$f":"IF(ISBLANK(Zakázka!S44),CHAR(32),Zakázka!S44)","v":" "},{"$f":"IF(ISBLANK(Zakázka!E44),CHAR(32),(Zakázka!$I$12))","v":" "}," "," ",{"$f":"IF(ISBLANK(Zakázka!BA44),CHAR(32),Zakázka!BA44)","v":""}]
[{"$f":"IF(ISBLANK(Zakázka!E45),CHAR(94),IF(ISTEXT(Zakázka!E45),CHAR(32),Zakázka!E45))","v":"^"},{"$f":"IF(ISBLANK(Zakázka!E45),CHAR(32),Zakázka!E45)","v":" "},{"$f":"IF(ISBLANK(Zakázka!BG45),CHAR(32),Zakázka!BG45)","v":" "},{"$f":"IF(ISBLANK(Zakázka!BH45),CHAR(32),Zakázka!BH45)","v":" "},{"$f":"IF(ISBLANK(Zakázka!E45),CHAR(32),Zakázka!$I$11)","v":" "},{"$f":"IF(ISBLANK(Zakázka!E45),CHAR(32),Zakázka!$I$10)","v":" "},{"$f":"IF(ISBLANK(Zakázka!U45),CHAR(32),Zakázka!U45)","v":" "},{"$f":"IF(ISBLANK(Zakázka!S45),CHAR(32),Zakázka!S45)","v":" "},{"$f":"IF(ISBLANK(Zakázka!E45),CHAR(32),(Zakázka!$I$12))","v":" "}," "," ",{"$f":"IF(ISBLANK(Zakázka!BA45),CHAR(32),Zakázka!BA45)","v":""}]
[{"$f":"IF(ISBLANK(Zakázka!E46),CHAR(94),IF(ISTEXT(Zakázka!E46),CHAR(32),Zakázka!E46))","v":"^"},{"$f":"IF(ISBLANK(Zakázka!E46),CHAR(32),Zakázka!E46)","v":" "},{"$f":"IF(ISBLANK(Zakázka!BG46),CHAR(32),Zakázka!BG46)","v":" "},{"$f":"IF(ISBLANK(Zakázka!BH46),CHAR(32),Zakázka!BH46)","v":" "},{"$f":"IF(ISBLANK(Zakázka!E46),CHAR(32),Zakázka!$I$11)","v":" "},{"$f":"IF(ISBLANK(Zakázka!E46),CHAR(32),Zakázka!$I$10)","v":" "},{"$f":"IF(ISBLANK(Zakázka!U46),CHAR(32),Zakázka!U46)","v":" "},{"$f":"IF(ISBLANK(Zakázka!S46),CHAR(32),Zakázka!S46)","v":" "},{"$f":"IF(ISBLANK(Zakázka!E46),CHAR(32),(Zakázka!$I$12))","v":" "}," "," ",{"$f":"IF(ISBLANK(Zakázka!BA46),CHAR(32),Zakázka!BA46)","v":""}]
[{"$f":"IF(ISBLANK(Zakázka!E47),CHAR(94),IF(ISTEXT(Zakázka!E47),CHAR(32),Zakázka!E47))","v":"^"},{"$f":"IF(ISBLANK(Zakázka!E47),CHAR(32),Zakázka!E47)","v":" "},{"$f":"IF(ISBLANK(Zakázka!BG47),CHAR(32),Zakázka!BG47)","v":" "},{"$f":"IF(ISBLANK(Zakázka!BH47),CHAR(32),Zakázka!BH47)","v":" "},{"$f":"IF(ISBLANK(Zakázka!E47),CHAR(32),Zakázka!$I$11)","v":" "},{"$f":"IF(ISBLANK(Zakázka!E47),CHAR(32),Zakázka!$I$10)","v":" "},{"$f":"IF(ISBLANK(Zakázka!U47),CHAR(32),Zakázka!U47)","v":" "},{"$f":"IF(ISBLANK(Zakázka!S47),CHAR(32),Zakázka!S47)","v":" "},{"$f":"IF(ISBLANK(Zakázka!E47),CHAR(32),(Zakázka!$I$12))","v":" "}," "," ",{"$f":"IF(ISBLANK(Zakázka!BA47),CHAR(32),Zakázka!BA47)","v":""}]
[{"$f":"IF(ISBLANK(Zakázka!E48),CHAR(94),IF(ISTEXT(Zakázka!E48),CHAR(32),Zakázka!E48))","v":"^"},{"$f":"IF(ISBLANK(Zakázka!E48),CHAR(32),Zakázka!E48)","v":" "},{"$f":"IF(ISBLANK(Zakázka!BG48),CHAR(32),Zakázka!BG48)","v":" "},{"$f":"IF(ISBLANK(Zakázka!BH48),CHAR(32),Zakázka!BH48)","v":" "},{"$f":"IF(ISBLANK(Zakázka!E48),CHAR(32),Zakázka!$I$11)","v":" "},{"$f":"IF(ISBLANK(Zakázka!E48),CHAR(32),Zakázka!$I$10)","v":" "},{"$f":"IF(ISBLANK(Zakázka!U48),CHAR(32),Zakázka!U48)","v":" "},{"$f":"IF(ISBLANK(Zakázka!S48),CHAR(32),Zakázka!S48)","v":" "},{"$f":"IF(ISBLANK(Zakázka!E48),CHAR(32),(Zakázka!$I$12))","v":" "}," "," ",{"$f":"IF(ISBLANK(Zakázka!BA48),CHAR(32),Zakázka!BA48)","v":""}]
[{"$f":"IF(ISBLANK(Zakázka!E49),CHAR(94),IF(ISTEXT(Zakázka!E49),CHAR(32),Zakázka!E49))","v":"^"},{"$f":"IF(ISBLANK(Zakázka!E49),CHAR(32),Zakázka!E49)","v":" "},{"$f":"IF(ISBLANK(Zakázka!BG49),CHAR(32),Zakázka!BG49)","v":" "},{"$f":"IF(ISBLANK(Zakázka!BH49),CHAR(32),Zakázka!BH49)","v":" "},{"$f":"IF(ISBLANK(Zakázka!E49),CHAR(32),Zakázka!$I$11)","v":" "},{"$f":"IF(ISBLANK(Zakázka!E49),CHAR(32),Zakázka!$I$10)","v":" "},{"$f":"IF(ISBLANK(Zakázka!U49),CHAR(32),Zakázka!U49)","v":" "},{"$f":"IF(ISBLANK(Zakázka!S49),CHAR(32),Zakázka!S49)","v":" "},{"$f":"IF(ISBLANK(Zakázka!E49),CHAR(32),(Zakázka!$I$12))","v":" "}," "," ",{"$f":"IF(ISBLANK(Zakázka!BA49),CHAR(32),Zakázka!BA49)","v":""}]
[{"$f":"IF(ISBLANK(Zakázka!E50),CHAR(94),IF(ISTEXT(Zakázka!E50),CHAR(32),Zakázka!E50))","v":"^"},{"$f":"IF(ISBLANK(Zakázka!E50),CHAR(32),Zakázka!E50)","v":" "},{"$f":"IF(ISBLANK(Zakázka!BG50),CHAR(32),Zakázka!BG50)","v":" "},{"$f":"IF(ISBLANK(Zakázka!BH50),CHAR(32),Zakázka!BH50)","v":" "},{"$f":"IF(ISBLANK(Zakázka!E50),CHAR(32),Zakázka!$I$11)","v":" "},{"$f":"IF(ISBLANK(Zakázka!E50),CHAR(32),Zakázka!$I$10)","v":" "},{"$f":"IF(ISBLANK(Zakázka!U50),CHAR(32),Zakázka!U50)","v":" "},{"$f":"IF(ISBLANK(Zakázka!S50),CHAR(32),Zakázka!S50)","v":" "},{"$f":"IF(ISBLANK(Zakázka!E50),CHAR(32),(Zakázka!$I$12))","v":" "}," "," ",{"$f":"IF(ISBLANK(Zakázka!BA50),CHAR(32),Zakázka!BA50)","v":""}]
[{"$f":"IF(ISBLANK(Zakázka!E51),CHAR(94),IF(ISTEXT(Zakázka!E51),CHAR(32),Zakázka!E51))","v":"^"},{"$f":"IF(ISBLANK(Zakázka!E51),CHAR(32),Zakázka!E51)","v":" "},{"$f":"IF(ISBLANK(Zakázka!BG51),CHAR(32),Zakázka!BG51)","v":" "},{"$f":"IF(ISBLANK(Zakázka!BH51),CHAR(32),Zakázka!BH51)","v":" "},{"$f":"IF(ISBLANK(Zakázka!E51),CHAR(32),Zakázka!$I$11)","v":" "},{"$f":"IF(ISBLANK(Zakázka!E51),CHAR(32),Zakázka!$I$10)","v":" "},{"$f":"IF(ISBLANK(Zakázka!U51),CHAR(32),Zakázka!U51)","v":" "},{"$f":"IF(ISBLANK(Zakázka!S51),CHAR(32),Zakázka!S51)","v":" "},{"$f":"IF(ISBLANK(Zakázka!E51),CHAR(32),(Zakázka!$I$12))","v":" "}," "," ",{"$f":"IF(ISBLANK(Zakázka!BA51),CHAR(32),Zakázka!BA51)","v":""}]
[{"$f":"IF(ISBLANK(Zakázka!E52),CHAR(94),IF(ISTEXT(Zakázka!E52),CHAR(32),Zakázka!E52))","v":"^"},{"$f":"IF(ISBLANK(Zakázka!E52),CHAR(32),Zakázka!E52)","v":" "},{"$f":"IF(ISBLANK(Zakázka!BG52),CHAR(32),Zakázka!BG52)","v":" "},{"$f":"IF(ISBLANK(Zakázka!BH52),CHAR(32),Zakázka!BH52)","v":" "},{"$f":"IF(ISBLANK(Zakázka!E52),CHAR(32),Zakázka!$I$11)","v":" "},{"$f":"IF(ISBLANK(Zakázka!E52),CHAR(32),Zakázka!$I$10)","v":" "},{"$f":"IF(ISBLANK(Zakázka!U52),CHAR(32),Zakázka!U52)","v":" "},{"$f":"IF(ISBLANK(Zakázka!S52),CHAR(32),Zakázka!S52)","v":" "},{"$f":"IF(ISBLANK(Zakázka!E52),CHAR(32),(Zakázka!$I$12))","v":" "}," "," ",{"$f":"IF(ISBLANK(Zakázka!BA52),CHAR(32),Zakázka!BA52)","v":""}]
[{"$f":"IF(ISBLANK(Zakázka!E53),CHAR(94),IF(ISTEXT(Zakázka!E53),CHAR(32),Zakázka!E53))","v":"^"},{"$f":"IF(ISBLANK(Zakázka!E53),CHAR(32),Zakázka!E53)","v":" "},{"$f":"IF(ISBLANK(Zakázka!BG53),CHAR(32),Zakázka!BG53)","v":" "},{"$f":"IF(ISBLANK(Zakázka!BH53),CHAR(32),Zakázka!BH53)","v":" "},{"$f":"IF(ISBLANK(Zakázka!E53),CHAR(32),Zakázka!$I$11)","v":" "},{"$f":"IF(ISBLANK(Zakázka!E53),CHAR(32),Zakázka!$I$10)","v":" "},{"$f":"IF(ISBLANK(Zakázka!U53),CHAR(32),Zakázka!U53)","v":" "},{"$f":"IF(ISBLANK(Zakázka!S53),CHAR(32),Zakázka!S53)","v":" "},{"$f":"IF(ISBLANK(Zakázka!E53),CHAR(32),(Zakázka!$I$12))","v":" "}," "," ",{"$f":"IF(ISBLANK(Zakázka!BA53),CHAR(32),Zakázka!BA53)","v":""}]
[{"$f":"IF(ISBLANK(Zakázka!E54),CHAR(94),IF(ISTEXT(Zakázka!E54),CHAR(32),Zakázka!E54))","v":"^"},{"$f":"IF(ISBLANK(Zakázka!E54),CHAR(32),Zakázka!E54)","v":" "},{"$f":"IF(ISBLANK(Zakázka!BG54),CHAR(32),Zakázka!BG54)","v":" "},{"$f":"IF(ISBLANK(Zakázka!BH54),CHAR(32),Zakázka!BH54)","v":" "},{"$f":"IF(ISBLANK(Zakázka!E54),CHAR(32),Zakázka!$I$11)","v":" "},{"$f":"IF(ISBLANK(Zakázka!E54),CHAR(32),Zakázka!$I$10)","v":" "},{"$f":"IF(ISBLANK(Zakázka!U54),CHAR(32),Zakázka!U54)","v":" "},{"$f":"IF(ISBLANK(Zakázka!S54),CHAR(32),Zakázka!S54)","v":" "},{"$f":"IF(ISBLANK(Zakázka!E54),CHAR(32),(Zakázka!$I$12))","v":" "}," "," ",{"$f":"IF(ISBLANK(Zakázka!BA54),CHAR(32),Zakázka!BA54)","v":""}]
[{"$f":"IF(ISBLANK(Zakázka!E55),CHAR(94),IF(ISTEXT(Zakázka!E55),CHAR(32),Zakázka!E55))","v":"^"},{"$f":"IF(ISBLANK(Zakázka!E55),CHAR(32),Zakázka!E55)","v":" "},{"$f":"IF(ISBLANK(Zakázka!BG55),CHAR(32),Zakázka!BG55)","v":" "},{"$f":"IF(ISBLANK(Zakázka!BH55),CHAR(32),Zakázka!BH55)","v":" "},{"$f":"IF(ISBLANK(Zakázka!E55),CHAR(32),Zakázka!$I$11)","v":" "},{"$f":"IF(ISBLANK(Zakázka!E55),CHAR(32),Zakázka!$I$10)","v":" "},{"$f":"IF(ISBLANK(Zakázka!U55),CHAR(32),Zakázka!U55)","v":" "},{"$f":"IF(ISBLANK(Zakázka!S55),CHAR(32),Zakázka!S55)","v":" "},{"$f":"IF(ISBLANK(Zakázka!E55),CHAR(32),(Zakázka!$I$12))","v":" "}," "," ",{"$f":"IF(ISBLANK(Zakázka!BA55),CHAR(32),Zakázka!BA55)","v":""}]
[{"$f":"IF(ISBLANK(Zakázka!E56),CHAR(94),IF(ISTEXT(Zakázka!E56),CHAR(32),Zakázka!E56))","v":"^"},{"$f":"IF(ISBLANK(Zakázka!E56),CHAR(32),Zakázka!E56)","v":" "},{"$f":"IF(ISBLANK(Zakázka!BG56),CHAR(32),Zakázka!BG56)","v":" "},{"$f":"IF(ISBLANK(Zakázka!BH56),CHAR(32),Zakázka!BH56)","v":" "},{"$f":"IF(ISBLANK(Zakázka!E56),CHAR(32),Zakázka!$I$11)","v":" "},{"$f":"IF(ISBLANK(Zakázka!E56),CHAR(32),Zakázka!$I$10)","v":" "},{"$f":"IF(ISBLANK(Zakázka!U56),CHAR(32),Zakázka!U56)","v":" "},{"$f":"IF(ISBLANK(Zakázka!S56),CHAR(32),Zakázka!S56)","v":" "},{"$f":"IF(ISBLANK(Zakázka!E56),CHAR(32),(Zakázka!$I$12))","v":" "}," "," ",{"$f":"IF(ISBLANK(Zakázka!BA56),CHAR(32),Zakázka!BA56)","v":""}]
[{"$f":"IF(ISBLANK(Zakázka!E57),CHAR(94),IF(ISTEXT(Zakázka!E57),CHAR(32),Zakázka!E57))","v":"^"},{"$f":"IF(ISBLANK(Zakázka!E57),CHAR(32),Zakázka!E57)","v":" "},{"$f":"IF(ISBLANK(Zakázka!BG57),CHAR(32),Zakázka!BG57)","v":" "},{"$f":"IF(ISBLANK(Zakázka!BH57),CHAR(32),Zakázka!BH57)","v":" "},{"$f":"IF(ISBLANK(Zakázka!E57),CHAR(32),Zakázka!$I$11)","v":" "},{"$f":"IF(ISBLANK(Zakázka!E57),CHAR(32),Zakázka!$I$10)","v":" "},{"$f":"IF(ISBLANK(Zakázka!U57),CHAR(32),Zakázka!U57)","v":" "},{"$f":"IF(ISBLANK(Zakázka!S57),CHAR(32),Zakázka!S57)","v":" "},{"$f":"IF(ISBLANK(Zakázka!E57),CHAR(32),(Zakázka!$I$12))","v":" "}," "," ",{"$f":"IF(ISBLANK(Zakázka!BA57),CHAR(32),Zakázka!BA57)","v":""}]
[{"$f":"IF(ISBLANK(Zakázka!E58),CHAR(94),IF(ISTEXT(Zakázka!E58),CHAR(32),Zakázka!E58))","v":"^"},{"$f":"IF(ISBLANK(Zakázka!E58),CHAR(32),Zakázka!E58)","v":" "},{"$f":"IF(ISBLANK(Zakázka!BG58),CHAR(32),Zakázka!BG58)","v":" "},{"$f":"IF(ISBLANK(Zakázka!BH58),CHAR(32),Zakázka!BH58)","v":" "},{"$f":"IF(ISBLANK(Zakázka!E58),CHAR(32),Zakázka!$I$11)","v":" "},{"$f":"IF(ISBLANK(Zakázka!E58),CHAR(32),Zakázka!$I$10)","v":" "},{"$f":"IF(ISBLANK(Zakázka!U58),CHAR(32),Zakázka!U58)","v":" "},{"$f":"IF(ISBLANK(Zakázka!S58),CHAR(32),Zakázka!S58)","v":" "},{"$f":"IF(ISBLANK(Zakázka!E58),CHAR(32),(Zakázka!$I$12))","v":" "}," "," ",{"$f":"IF(ISBLANK(Zakázka!BA58),CHAR(32),Zakázka!BA58)","v":""}]
[{"$f":"IF(ISBLANK(Zakázka!E59),CHAR(94),IF(ISTEXT(Zakázka!E59),CHAR(32),Zakázka!E59))","v":"^"},{"$f":"IF(ISBLANK(Zakázka!E59),CHAR(32),Zakázka!E59)","v":" "},{"$f":"IF(ISBLANK(Zakázka!BG59),CHAR(32),Zakázka!BG59)","v":" "},{"$f":"IF(ISBLANK(Zakázka!BH59),CHAR(32),Zakázka!BH59)","v":" "},{"$f":"IF(ISBLANK(Zakázka!E59),CHAR(32),Zakázka!$I$11)","v":" "},{"$f":"IF(ISBLANK(Zakázka!E59),CHAR(32),Zakázka!$I$10)","v":" "},{"$f":"IF(ISBLANK(Zakázka!U59),CHAR(32),Zakázka!U59)","v":" "},{"$f":"IF(ISBLANK(Zakázka!S59),CHAR(32),Zakázka!S59)","v":" "},{"$f":"IF(ISBLANK(Zakázka!E59),CHAR(32),(Zakázka!$I$12))","v":" "}," "," ",{"$f":"IF(ISBLANK(Zakázka!BA59),CHAR(32),Zakázka!BA59)","v":""}]
[{"$f":"IF(ISBLANK(Zakázka!E60),CHAR(94),IF(ISTEXT(Zakázka!E60),CHAR(32),Zakázka!E60))","v":"^"},{"$f":"IF(ISBLANK(Zakázka!E60),CHAR(32),Zakázka!E60)","v":" "},{"$f":"IF(ISBLANK(Zakázka!BG60),CHAR(32),Zakázka!BG60)","v":" "},{"$f":"IF(ISBLANK(Zakázka!BH60),CHAR(32),Zakázka!BH60)","v":" "},{"$f":"IF(ISBLANK(Zakázka!E60),CHAR(32),Zakázka!$I$11)","v":" "},{"$f":"IF(ISBLANK(Zakázka!E60),CHAR(32),Zakázka!$I$10)","v":" "},{"$f":"IF(ISBLANK(Zakázka!U60),CHAR(32),Zakázka!U60)","v":" "},{"$f":"IF(ISBLANK(Zakázka!S60),CHAR(32),Zakázka!S60)","v":" "},{"$f":"IF(ISBLANK(Zakázka!E60),CHAR(32),(Zakázka!$I$12))","v":" "}," "," ",{"$f":"IF(ISBLANK(Zakázka!BA60),CHAR(32),Zakázka!BA60)","v":""}]
[{"$f":"IF(ISBLANK(Zakázka!E61),CHAR(94),IF(ISTEXT(Zakázka!E61),CHAR(32),Zakázka!E61))","v":"^"},{"$f":"IF(ISBLANK(Zakázka!E61),CHAR(32),Zakázka!E61)","v":" "},{"$f":"IF(ISBLANK(Zakázka!BG61),CHAR(32),Zakázka!BG61)","v":" "},{"$f":"IF(ISBLANK(Zakázka!BH61),CHAR(32),Zakázka!BH61)","v":" "},{"$f":"IF(ISBLANK(Zakázka!E61),CHAR(32),Zakázka!$I$11)","v":" "},{"$f":"IF(ISBLANK(Zakázka!E61),CHAR(32),Zakázka!$I$10)","v":" "},{"$f":"IF(ISBLANK(Zakázka!U61),CHAR(32),Zakázka!U61)","v":" "},{"$f":"IF(ISBLANK(Zakázka!S61),CHAR(32),Zakázka!S61)","v":" "},{"$f":"IF(ISBLANK(Zakázka!E61),CHAR(32),(Zakázka!$I$12))","v":" "}," "," ",{"$f":"IF(ISBLANK(Zakázka!BA61),CHAR(32),Zakázka!BA61)","v":""}]
[{"$f":"IF(ISBLANK(Zakázka!E62),CHAR(94),IF(ISTEXT(Zakázka!E62),CHAR(32),Zakázka!E62))","v":"^"},{"$f":"IF(ISBLANK(Zakázka!E62),CHAR(32),Zakázka!E62)","v":" "},{"$f":"IF(ISBLANK(Zakázka!BG62),CHAR(32),Zakázka!BG62)","v":" "},{"$f":"IF(ISBLANK(Zakázka!BH62),CHAR(32),Zakázka!BH62)","v":" "},{"$f":"IF(ISBLANK(Zakázka!E62),CHAR(32),Zakázka!$I$11)","v":" "},{"$f":"IF(ISBLANK(Zakázka!E62),CHAR(32),Zakázka!$I$10)","v":" "},{"$f":"IF(ISBLANK(Zakázka!U62),CHAR(32),Zakázka!U62)","v":" "},{"$f":"IF(ISBLANK(Zakázka!S62),CHAR(32),Zakázka!S62)","v":" "},{"$f":"IF(ISBLANK(Zakázka!E62),CHAR(32),(Zakázka!$I$12))","v":" "}," "," ",{"$f":"IF(ISBLANK(Zakázka!BA62),CHAR(32),Zakázka!BA62)","v":""}]
[{"$f":"IF(ISBLANK(Zakázka!E63),CHAR(94),IF(ISTEXT(Zakázka!E63),CHAR(32),Zakázka!E63))","v":"^"},{"$f":"IF(ISBLANK(Zakázka!E63),CHAR(32),Zakázka!E63)","v":" "},{"$f":"IF(ISBLANK(Zakázka!BG63),CHAR(32),Zakázka!BG63)","v":" "},{"$f":"IF(ISBLANK(Zakázka!BH63),CHAR(32),Zakázka!BH63)","v":" "},{"$f":"IF(ISBLANK(Zakázka!E63),CHAR(32),Zakázka!$I$11)","v":" "},{"$f":"IF(ISBLANK(Zakázka!E63),CHAR(32),Zakázka!$I$10)","v":" "},{"$f":"IF(ISBLANK(Zakázka!U63),CHAR(32),Zakázka!U63)","v":" "},{"$f":"IF(ISBLANK(Zakázka!S63),CHAR(32),Zakázka!S63)","v":" "},{"$f":"IF(ISBLANK(Zakázka!E63),CHAR(32),(Zakázka!$I$12))","v":" "}," "," ",{"$f":"IF(ISBLANK(Zakázka!BA63),CHAR(32),Zakázka!BA63)","v":""}]
[{"$f":"IF(ISBLANK(Zakázka!E64),CHAR(94),IF(ISTEXT(Zakázka!E64),CHAR(32),Zakázka!E64))","v":"^"},{"$f":"IF(ISBLANK(Zakázka!E64),CHAR(32),Zakázka!E64)","v":" "},{"$f":"IF(ISBLANK(Zakázka!BG64),CHAR(32),Zakázka!BG64)","v":" "},{"$f":"IF(ISBLANK(Zakázka!BH64),CHAR(32),Zakázka!BH64)","v":" "},{"$f":"IF(ISBLANK(Zakázka!E64),CHAR(32),Zakázka!$I$11)","v":" "},{"$f":"IF(ISBLANK(Zakázka!E64),CHAR(32),Zakázka!$I$10)","v":" "},{"$f":"IF(ISBLANK(Zakázka!U64),CHAR(32),Zakázka!U64)","v":" "},{"$f":"IF(ISBLANK(Zakázka!S64),CHAR(32),Zakázka!S64)","v":" "},{"$f":"IF(ISBLANK(Zakázka!E64),CHAR(32),(Zakázka!$I$12))","v":" "}," "," ",{"$f":"IF(ISBLANK(Zakázka!BA64),CHAR(32),Zakázka!BA64)","v":""}]
[{"$f":"IF(ISBLANK(Zakázka!E65),CHAR(94),IF(ISTEXT(Zakázka!E65),CHAR(32),Zakázka!E65))","v":"^"},{"$f":"IF(ISBLANK(Zakázka!E65),CHAR(32),Zakázka!E65)","v":" "},{"$f":"IF(ISBLANK(Zakázka!BG65),CHAR(32),Zakázka!BG65)","v":" "},{"$f":"IF(ISBLANK(Zakázka!BH65),CHAR(32),Zakázka!BH65)","v":" "},{"$f":"IF(ISBLANK(Zakázka!E65),CHAR(32),Zakázka!$I$11)","v":" "},{"$f":"IF(ISBLANK(Zakázka!E65),CHAR(32),Zakázka!$I$10)","v":" "},{"$f":"IF(ISBLANK(Zakázka!U65),CHAR(32),Zakázka!U65)","v":" "},{"$f":"IF(ISBLANK(Zakázka!S65),CHAR(32),Zakázka!S65)","v":" "},{"$f":"IF(ISBLANK(Zakázka!E65),CHAR(32),(Zakázka!$I$12))","v":" "}," "," ",{"$f":"IF(ISBLANK(Zakázka!BA65),CHAR(32),Zakázka!BA65)","v":""}]
[{"$f":"IF(ISBLANK(Zakázka!E66),CHAR(94),IF(ISTEXT(Zakázka!E66),CHAR(32),Zakázka!E66))","v":"^"},{"$f":"IF(ISBLANK(Zakázka!E66),CHAR(32),Zakázka!E66)","v":" "},{"$f":"IF(ISBLANK(Zakázka!BG66),CHAR(32),Zakázka!BG66)","v":" "},{"$f":"IF(ISBLANK(Zakázka!BH66),CHAR(32),Zakázka!BH66)","v":" "},{"$f":"IF(ISBLANK(Zakázka!E66),CHAR(32),Zakázka!$I$11)","v":" "},{"$f":"IF(ISBLANK(Zakázka!E66),CHAR(32),Zakázka!$I$10)","v":" "},{"$f":"IF(ISBLANK(Zakázka!U66),CHAR(32),Zakázka!U66)","v":" "},{"$f":"IF(ISBLANK(Zakázka!S66),CHAR(32),Zakázka!S66)","v":" "},{"$f":"IF(ISBLANK(Zakázka!E66),CHAR(32),(Zakázka!$I$12))","v":" "}," "," ",{"$f":"IF(ISBLANK(Zakázka!BA66),CHAR(32),Zakázka!BA66)","v":""}]
[{"$f":"IF(ISBLANK(Zakázka!E67),CHAR(94),IF(ISTEXT(Zakázka!E67),CHAR(32),Zakázka!E67))","v":"^"},{"$f":"IF(ISBLANK(Zakázka!E67),CHAR(32),Zakázka!E67)","v":" "},{"$f":"IF(ISBLANK(Zakázka!BG67),CHAR(32),Zakázka!BG67)","v":" "},{"$f":"IF(ISBLANK(Zakázka!BH67),CHAR(32),Zakázka!BH67)","v":" "},{"$f":"IF(ISBLANK(Zakázka!E67),CHAR(32),Zakázka!$I$11)","v":" "},{"$f":"IF(ISBLANK(Zakázka!E67),CHAR(32),Zakázka!$I$10)","v":" "},{"$f":"IF(ISBLANK(Zakázka!U67),CHAR(32),Zakázka!U67)","v":" "},{"$f":"IF(ISBLANK(Zakázka!S67),CHAR(32),Zakázka!S67)","v":" "},{"$f":"IF(ISBLANK(Zakázka!E67),CHAR(32),(Zakázka!$I$12))","v":" "}," "," ",{"$f":"IF(ISBLANK(Zakázka!BA67),CHAR(32),Zakázka!BA67)","v":""}]
[{"$f":"IF(ISBLANK(Zakázka!E68),CHAR(94),IF(ISTEXT(Zakázka!E68),CHAR(32),Zakázka!E68))","v":"^"},{"$f":"IF(ISBLANK(Zakázka!E68),CHAR(32),Zakázka!E68)","v":" "},{"$f":"IF(ISBLANK(Zakázka!BG68),CHAR(32),Zakázka!BG68)","v":" "},{"$f":"IF(ISBLANK(Zakázka!BH68),CHAR(32),Zakázka!BH68)","v":" "},{"$f":"IF(ISBLANK(Zakázka!E68),CHAR(32),Zakázka!$I$11)","v":" "},{"$f":"IF(ISBLANK(Zakázka!E68),CHAR(32),Zakázka!$I$10)","v":" "},{"$f":"IF(ISBLANK(Zakázka!U68),CHAR(32),Zakázka!U68)","v":" "},{"$f":"IF(ISBLANK(Zakázka!S68),CHAR(32),Zakázka!S68)","v":" "},{"$f":"IF(ISBLANK(Zakázka!E68),CHAR(32),(Zakázka!$I$12))","v":" "}," "," ",{"$f":"IF(ISBLANK(Zakázka!BA68),CHAR(32),Zakázka!BA68)","v":""}]
[{"$f":"IF(ISBLANK(Zakázka!E69),CHAR(94),IF(ISTEXT(Zakázka!E69),CHAR(32),Zakázka!E69))","v":"^"},{"$f":"IF(ISBLANK(Zakázka!E69),CHAR(32),Zakázka!E69)","v":" "},{"$f":"IF(ISBLANK(Zakázka!BG69),CHAR(32),Zakázka!BG69)","v":" "},{"$f":"IF(ISBLANK(Zakázka!BH69),CHAR(32),Zakázka!BH69)","v":" "},{"$f":"IF(ISBLANK(Zakázka!E69),CHAR(32),Zakázka!$I$11)","v":" "},{"$f":"IF(ISBLANK(Zakázka!E69),CHAR(32),Zakázka!$I$10)","v":" "},{"$f":"IF(ISBLANK(Zakázka!U69),CHAR(32),Zakázka!U69)","v":" "},{"$f":"IF(ISBLANK(Zakázka!S69),CHAR(32),Zakázka!S69)","v":" "},{"$f":"IF(ISBLANK(Zakázka!E69),CHAR(32),(Zakázka!$I$12))","v":" "}," "," ",{"$f":"IF(ISBLANK(Zakázka!BA69),CHAR(32),Zakázka!BA69)","v":""}]
[{"$f":"IF(ISBLANK(Zakázka!E70),CHAR(94),IF(ISTEXT(Zakázka!E70),CHAR(32),Zakázka!E70))","v":"^"},{"$f":"IF(ISBLANK(Zakázka!E70),CHAR(32),Zakázka!E70)","v":" "},{"$f":"IF(ISBLANK(Zakázka!BG70),CHAR(32),Zakázka!BG70)","v":" "},{"$f":"IF(ISBLANK(Zakázka!BH70),CHAR(32),Zakázka!BH70)","v":" "},{"$f":"IF(ISBLANK(Zakázka!E70),CHAR(32),Zakázka!$I$11)","v":" "},{"$f":"IF(ISBLANK(Zakázka!E70),CHAR(32),Zakázka!$I$10)","v":" "},{"$f":"IF(ISBLANK(Zakázka!U70),CHAR(32),Zakázka!U70)","v":" "},{"$f":"IF(ISBLANK(Zakázka!S70),CHAR(32),Zakázka!S70)","v":" "},{"$f":"IF(ISBLANK(Zakázka!E70),CHAR(32),(Zakázka!$I$12))","v":" "}," "," ",{"$f":"IF(ISBLANK(Zakázka!BA70),CHAR(32),Zakázka!BA70)","v":""}]
[{"$f":"IF(ISBLANK(Zakázka!E71),CHAR(94),IF(ISTEXT(Zakázka!E71),CHAR(32),Zakázka!E71))","v":"^"},{"$f":"IF(ISBLANK(Zakázka!E71),CHAR(32),Zakázka!E71)","v":" "},{"$f":"IF(ISBLANK(Zakázka!BG71),CHAR(32),Zakázka!BG71)","v":" "},{"$f":"IF(ISBLANK(Zakázka!BH71),CHAR(32),Zakázka!BH71)","v":" "},{"$f":"IF(ISBLANK(Zakázka!E71),CHAR(32),Zakázka!$I$11)","v":" "},{"$f":"IF(ISBLANK(Zakázka!E71),CHAR(32),Zakázka!$I$10)","v":" "},{"$f":"IF(ISBLANK(Zakázka!U71),CHAR(32),Zakázka!U71)","v":" "},{"$f":"IF(ISBLANK(Zakázka!S71),CHAR(32),Zakázka!S71)","v":" "},{"$f":"IF(ISBLANK(Zakázka!E71),CHAR(32),(Zakázka!$I$12))","v":" "}," "," ",{"$f":"IF(ISBLANK(Zakázka!BA71),CHAR(32),Zakázka!BA71)","v":""}]
[{"$f":"IF(ISBLANK(Zakázka!E72),CHAR(94),IF(ISTEXT(Zakázka!E72),CHAR(32),Zakázka!E72))","v":"^"},{"$f":"IF(ISBLANK(Zakázka!E72),CHAR(32),Zakázka!E72)","v":" "},{"$f":"IF(ISBLANK(Zakázka!BG72),CHAR(32),Zakázka!BG72)","v":" "},{"$f":"IF(ISBLANK(Zakázka!BH72),CHAR(32),Zakázka!BH72)","v":" "},{"$f":"IF(ISBLANK(Zakázka!E72),CHAR(32),Zakázka!$I$11)","v":" "},{"$f":"IF(ISBLANK(Zakázka!E72),CHAR(32),Zakázka!$I$10)","v":" "},{"$f":"IF(ISBLANK(Zakázka!U72),CHAR(32),Zakázka!U72)","v":" "},{"$f":"IF(ISBLANK(Zakázka!S72),CHAR(32),Zakázka!S72)","v":" "},{"$f":"IF(ISBLANK(Zakázka!E72),CHAR(32),(Zakázka!$I$12))","v":" "}," "," ",{"$f":"IF(ISBLANK(Zakázka!BA72),CHAR(32),Zakázka!BA72)","v":""}]
[{"$f":"IF(ISBLANK(Zakázka!E73),CHAR(94),IF(ISTEXT(Zakázka!E73),CHAR(32),Zakázka!E73))","v":"^"},{"$f":"IF(ISBLANK(Zakázka!E73),CHAR(32),Zakázka!E73)","v":" "},{"$f":"IF(ISBLANK(Zakázka!BG73),CHAR(32),Zakázka!BG73)","v":" "},{"$f":"IF(ISBLANK(Zakázka!BH73),CHAR(32),Zakázka!BH73)","v":" "},{"$f":"IF(ISBLANK(Zakázka!E73),CHAR(32),Zakázka!$I$11)","v":" "},{"$f":"IF(ISBLANK(Zakázka!E73),CHAR(32),Zakázka!$I$10)","v":" "},{"$f":"IF(ISBLANK(Zakázka!U73),CHAR(32),Zakázka!U73)","v":" "},{"$f":"IF(ISBLANK(Zakázka!S73),CHAR(32),Zakázka!S73)","v":" "},{"$f":"IF(ISBLANK(Zakázka!E73),CHAR(32),(Zakázka!$I$12))","v":" "}," "," ",{"$f":"IF(ISBLANK(Zakázka!BA73),CHAR(32),Zakázka!BA73)","v":""}]
[{"$f":"IF(ISBLANK(Zakázka!E74),CHAR(94),IF(ISTEXT(Zakázka!E74),CHAR(32),Zakázka!E74))","v":"^"},{"$f":"IF(ISBLANK(Zakázka!E74),CHAR(32),Zakázka!E74)","v":" "},{"$f":"IF(ISBLANK(Zakázka!BG74),CHAR(32),Zakázka!BG74)","v":" "},{"$f":"IF(ISBLANK(Zakázka!BH74),CHAR(32),Zakázka!BH74)","v":" "},{"$f":"IF(ISBLANK(Zakázka!E74),CHAR(32),Zakázka!$I$11)","v":" "},{"$f":"IF(ISBLANK(Zakázka!E74),CHAR(32),Zakázka!$I$10)","v":" "},{"$f":"IF(ISBLANK(Zakázka!U74),CHAR(32),Zakázka!U74)","v":" "},{"$f":"IF(ISBLANK(Zakázka!S74),CHAR(32),Zakázka!S74)","v":" "},{"$f":"IF(ISBLANK(Zakázka!E74),CHAR(32),(Zakázka!$I$12))","v":" "}," "," ",{"$f":"IF(ISBLANK(Zakázka!BA74),CHAR(32),Zakázka!BA74)","v":""}]
[{"$f":"IF(ISBLANK(Zakázka!E75),CHAR(94),IF(ISTEXT(Zakázka!E75),CHAR(32),Zakázka!E75))","v":"^"},{"$f":"IF(ISBLANK(Zakázka!E75),CHAR(32),Zakázka!E75)","v":" "},{"$f":"IF(ISBLANK(Zakázka!BG75),CHAR(32),Zakázka!BG75)","v":" "},{"$f":"IF(ISBLANK(Zakázka!BH75),CHAR(32),Zakázka!BH75)","v":" "},{"$f":"IF(ISBLANK(Zakázka!E75),CHAR(32),Zakázka!$I$11)","v":" "},{"$f":"IF(ISBLANK(Zakázka!E75),CHAR(32),Zakázka!$I$10)","v":" "},{"$f":"IF(ISBLANK(Zakázka!U75),CHAR(32),Zakázka!U75)","v":" "},{"$f":"IF(ISBLANK(Zakázka!S75),CHAR(32),Zakázka!S75)","v":" "},{"$f":"IF(ISBLANK(Zakázka!E75),CHAR(32),(Zakázka!$I$12))","v":" "}," "," ",{"$f":"IF(ISBLANK(Zakázka!BA75),CHAR(32),Zakázka!BA75)","v":""}]
[{"$f":"IF(ISBLANK(Zakázka!E76),CHAR(94),IF(ISTEXT(Zakázka!E76),CHAR(32),Zakázka!E76))","v":"^"},{"$f":"IF(ISBLANK(Zakázka!E76),CHAR(32),Zakázka!E76)","v":" "},{"$f":"IF(ISBLANK(Zakázka!BG76),CHAR(32),Zakázka!BG76)","v":" "},{"$f":"IF(ISBLANK(Zakázka!BH76),CHAR(32),Zakázka!BH76)","v":" "},{"$f":"IF(ISBLANK(Zakázka!E76),CHAR(32),Zakázka!$I$11)","v":" "},{"$f":"IF(ISBLANK(Zakázka!E76),CHAR(32),Zakázka!$I$10)","v":" "},{"$f":"IF(ISBLANK(Zakázka!U76),CHAR(32),Zakázka!U76)","v":" "},{"$f":"IF(ISBLANK(Zakázka!S76),CHAR(32),Zakázka!S76)","v":" "},{"$f":"IF(ISBLANK(Zakázka!E76),CHAR(32),(Zakázka!$I$12))","v":" "}," "," ",{"$f":"IF(ISBLANK(Zakázka!BA76),CHAR(32),Zakázka!BA76)","v":""}]
[{"$f":"IF(ISBLANK(Zakázka!E77),CHAR(94),IF(ISTEXT(Zakázka!E77),CHAR(32),Zakázka!E77))","v":"^"},{"$f":"IF(ISBLANK(Zakázka!E77),CHAR(32),Zakázka!E77)","v":" "},{"$f":"IF(ISBLANK(Zakázka!BG77),CHAR(32),Zakázka!BG77)","v":" "},{"$f":"IF(ISBLANK(Zakázka!BH77),CHAR(32),Zakázka!BH77)","v":" "},{"$f":"IF(ISBLANK(Zakázka!E77),CHAR(32),Zakázka!$I$11)","v":" "},{"$f":"IF(ISBLANK(Zakázka!E77),CHAR(32),Zakázka!$I$10)","v":" "},{"$f":"IF(ISBLANK(Zakázka!U77),CHAR(32),Zakázka!U77)","v":" "},{"$f":"IF(ISBLANK(Zakázka!S77),CHAR(32),Zakázka!S77)","v":" "},{"$f":"IF(ISBLANK(Zakázka!E77),CHAR(32),(Zakázka!$I$12))","v":" "}," "," ",{"$f":"IF(ISBLANK(Zakázka!BA77),CHAR(32),Zakázka!BA77)","v":""}]
[{"$f":"IF(ISBLANK(Zakázka!E78),CHAR(94),IF(ISTEXT(Zakázka!E78),CHAR(32),Zakázka!E78))","v":"^"},{"$f":"IF(ISBLANK(Zakázka!E78),CHAR(32),Zakázka!E78)","v":" "},{"$f":"IF(ISBLANK(Zakázka!BG78),CHAR(32),Zakázka!BG78)","v":" "},{"$f":"IF(ISBLANK(Zakázka!BH78),CHAR(32),Zakázka!BH78)","v":" "},{"$f":"IF(ISBLANK(Zakázka!E78),CHAR(32),Zakázka!$I$11)","v":" "},{"$f":"IF(ISBLANK(Zakázka!E78),CHAR(32),Zakázka!$I$10)","v":" "},{"$f":"IF(ISBLANK(Zakázka!U78),CHAR(32),Zakázka!U78)","v":" "},{"$f":"IF(ISBLANK(Zakázka!S78),CHAR(32),Zakázka!S78)","v":" "},{"$f":"IF(ISBLANK(Zakázka!E78),CHAR(32),(Zakázka!$I$12))","v":" "}," "," ",{"$f":"IF(ISBLANK(Zakázka!BA78),CHAR(32),Zakázka!BA78)","v":""}]
[{"$f":"IF(ISBLANK(Zakázka!E79),CHAR(94),IF(ISTEXT(Zakázka!E79),CHAR(32),Zakázka!E79))","v":"^"},{"$f":"IF(ISBLANK(Zakázka!E79),CHAR(32),Zakázka!E79)","v":" "},{"$f":"IF(ISBLANK(Zakázka!BG79),CHAR(32),Zakázka!BG79)","v":" "},{"$f":"IF(ISBLANK(Zakázka!BH79),CHAR(32),Zakázka!BH79)","v":" "},{"$f":"IF(ISBLANK(Zakázka!E79),CHAR(32),Zakázka!$I$11)","v":" "},{"$f":"IF(ISBLANK(Zakázka!E79),CHAR(32),Zakázka!$I$10)","v":" "},{"$f":"IF(ISBLANK(Zakázka!U79),CHAR(32),Zakázka!U79)","v":" "},{"$f":"IF(ISBLANK(Zakázka!S79),CHAR(32),Zakázka!S79)","v":" "},{"$f":"IF(ISBLANK(Zakázka!E79),CHAR(32),(Zakázka!$I$12))","v":" "}," "," ",{"$f":"IF(ISBLANK(Zakázka!BA79),CHAR(32),Zakázka!BA79)","v":""}]
[{"$f":"IF(ISBLANK(Zakázka!E80),CHAR(94),IF(ISTEXT(Zakázka!E80),CHAR(32),Zakázka!E80))","v":"^"},{"$f":"IF(ISBLANK(Zakázka!E80),CHAR(32),Zakázka!E80)","v":" "},{"$f":"IF(ISBLANK(Zakázka!BG80),CHAR(32),Zakázka!BG80)","v":" "},{"$f":"IF(ISBLANK(Zakázka!BH80),CHAR(32),Zakázka!BH80)","v":" "},{"$f":"IF(ISBLANK(Zakázka!E80),CHAR(32),Zakázka!$I$11)","v":" "},{"$f":"IF(ISBLANK(Zakázka!E80),CHAR(32),Zakázka!$I$10)","v":" "},{"$f":"IF(ISBLANK(Zakázka!U80),CHAR(32),Zakázka!U80)","v":" "},{"$f":"IF(ISBLANK(Zakázka!S80),CHAR(32),Zakázka!S80)","v":" "},{"$f":"IF(ISBLANK(Zakázka!E80),CHAR(32),(Zakázka!$I$12))","v":" "}," "," ",{"$f":"IF(ISBLANK(Zakázka!BA80),CHAR(32),Zakázka!BA80)","v":""}]
[{"$f":"IF(ISBLANK(Zakázka!E81),CHAR(94),IF(ISTEXT(Zakázka!E81),CHAR(32),Zakázka!E81))","v":"^"},{"$f":"IF(ISBLANK(Zakázka!E81),CHAR(32),Zakázka!E81)","v":" "},{"$f":"IF(ISBLANK(Zakázka!BG81),CHAR(32),Zakázka!BG81)","v":" "},{"$f":"IF(ISBLANK(Zakázka!BH81),CHAR(32),Zakázka!BH81)","v":" "},{"$f":"IF(ISBLANK(Zakázka!E81),CHAR(32),Zakázka!$I$11)","v":" "},{"$f":"IF(ISBLANK(Zakázka!E81),CHAR(32),Zakázka!$I$10)","v":" "},{"$f":"IF(ISBLANK(Zakázka!U81),CHAR(32),Zakázka!U81)","v":" "},{"$f":"IF(ISBLANK(Zakázka!S81),CHAR(32),Zakázka!S81)","v":" "},{"$f":"IF(ISBLANK(Zakázka!E81),CHAR(32),(Zakázka!$I$12))","v":" "}," "," ",{"$f":"IF(ISBLANK(Zakázka!BA81),CHAR(32),Zakázka!BA81)","v":""}]
[{"$f":"IF(ISBLANK(Zakázka!E82),CHAR(94),IF(ISTEXT(Zakázka!E82),CHAR(32),Zakázka!E82))","v":"^"},{"$f":"IF(ISBLANK(Zakázka!E82),CHAR(32),Zakázka!E82)","v":" "},{"$f":"IF(ISBLANK(Zakázka!BG82),CHAR(32),Zakázka!BG82)","v":" "},{"$f":"IF(ISBLANK(Zakázka!BH82),CHAR(32),Zakázka!BH82)","v":" "},{"$f":"IF(ISBLANK(Zakázka!E82),CHAR(32),Zakázka!$I$11)","v":" "},{"$f":"IF(ISBLANK(Zakázka!E82),CHAR(32),Zakázka!$I$10)","v":" "},{"$f":"IF(ISBLANK(Zakázka!U82),CHAR(32),Zakázka!U82)","v":" "},{"$f":"IF(ISBLANK(Zakázka!S82),CHAR(32),Zakázka!S82)","v":" "},{"$f":"IF(ISBLANK(Zakázka!E82),CHAR(32),(Zakázka!$I$12))","v":" "}," "," ",{"$f":"IF(ISBLANK(Zakázka!BA82),CHAR(32),Zakázka!BA82)","v":""}]
[{"$f":"IF(ISBLANK(Zakázka!E83),CHAR(94),IF(ISTEXT(Zakázka!E83),CHAR(32),Zakázka!E83))","v":"^"},{"$f":"IF(ISBLANK(Zakázka!E83),CHAR(32),Zakázka!E83)","v":" "},{"$f":"IF(ISBLANK(Zakázka!BG83),CHAR(32),Zakázka!BG83)","v":" "},{"$f":"IF(ISBLANK(Zakázka!BH83),CHAR(32),Zakázka!BH83)","v":" "},{"$f":"IF(ISBLANK(Zakázka!E83),CHAR(32),Zakázka!$I$11)","v":" "},{"$f":"IF(ISBLANK(Zakázka!E83),CHAR(32),Zakázka!$I$10)","v":" "},{"$f":"IF(ISBLANK(Zakázka!U83),CHAR(32),Zakázka!U83)","v":" "},{"$f":"IF(ISBLANK(Zakázka!S83),CHAR(32),Zakázka!S83)","v":" "},{"$f":"IF(ISBLANK(Zakázka!E83),CHAR(32),(Zakázka!$I$12))","v":" "}," "," ",{"$f":"IF(ISBLANK(Zakázka!BA83),CHAR(32),Zakázka!BA83)","v":""}]
[{"$f":"IF(ISBLANK(Zakázka!E84),CHAR(94),IF(ISTEXT(Zakázka!E84),CHAR(32),Zakázka!E84))","v":"^"},{"$f":"IF(ISBLANK(Zakázka!E84),CHAR(32),Zakázka!E84)","v":" "},{"$f":"IF(ISBLANK(Zakázka!BG84),CHAR(32),Zakázka!BG84)","v":" "},{"$f":"IF(ISBLANK(Zakázka!BH84),CHAR(32),Zakázka!BH84)","v":" "},{"$f":"IF(ISBLANK(Zakázka!E84),CHAR(32),Zakázka!$I$11)","v":" "},{"$f":"IF(ISBLANK(Zakázka!E84),CHAR(32),Zakázka!$I$10)","v":" "},{"$f":"IF(ISBLANK(Zakázka!U84),CHAR(32),Zakázka!U84)","v":" "},{"$f":"IF(ISBLANK(Zakázka!S84),CHAR(32),Zakázka!S84)","v":" "},{"$f":"IF(ISBLANK(Zakázka!E84),CHAR(32),(Zakázka!$I$12))","v":" "}," "," ",{"$f":"IF(ISBLANK(Zakázka!BA84),CHAR(32),Zakázka!BA84)","v":""}]
[{"$f":"IF(ISBLANK(Zakázka!E85),CHAR(94),IF(ISTEXT(Zakázka!E85),CHAR(32),Zakázka!E85))","v":"^"},{"$f":"IF(ISBLANK(Zakázka!E85),CHAR(32),Zakázka!E85)","v":" "},{"$f":"IF(ISBLANK(Zakázka!BG85),CHAR(32),Zakázka!BG85)","v":" "},{"$f":"IF(ISBLANK(Zakázka!BH85),CHAR(32),Zakázka!BH85)","v":" "},{"$f":"IF(ISBLANK(Zakázka!E85),CHAR(32),Zakázka!$I$11)","v":" "},{"$f":"IF(ISBLANK(Zakázka!E85),CHAR(32),Zakázka!$I$10)","v":" "},{"$f":"IF(ISBLANK(Zakázka!U85),CHAR(32),Zakázka!U85)","v":" "},{"$f":"IF(ISBLANK(Zakázka!S85),CHAR(32),Zakázka!S85)","v":" "},{"$f":"IF(ISBLANK(Zakázka!E85),CHAR(32),(Zakázka!$I$12))","v":" "}," "," ",{"$f":"IF(ISBLANK(Zakázka!BA85),CHAR(32),Zakázka!BA85)","v":""}]
[{"$f":"IF(ISBLANK(Zakázka!E86),CHAR(94),IF(ISTEXT(Zakázka!E86),CHAR(32),Zakázka!E86))","v":"^"},{"$f":"IF(ISBLANK(Zakázka!E86),CHAR(32),Zakázka!E86)","v":" "},{"$f":"IF(ISBLANK(Zakázka!BG86),CHAR(32),Zakázka!BG86)","v":" "},{"$f":"IF(ISBLANK(Zakázka!BH86),CHAR(32),Zakázka!BH86)","v":" "},{"$f":"IF(ISBLANK(Zakázka!E86),CHAR(32),Zakázka!$I$11)","v":" "},{"$f":"IF(ISBLANK(Zakázka!E86),CHAR(32),Zakázka!$I$10)","v":" "},{"$f":"IF(ISBLANK(Zakázka!U86),CHAR(32),Zakázka!U86)","v":" "},{"$f":"IF(ISBLANK(Zakázka!S86),CHAR(32),Zakázka!S86)","v":" "},{"$f":"IF(ISBLANK(Zakázka!E86),CHAR(32),(Zakázka!$I$12))","v":" "}," "," ",{"$f":"IF(ISBLANK(Zakázka!BA86),CHAR(32),Zakázka!BA86)","v":""}]
[{"$f":"IF(ISBLANK(Zakázka!E87),CHAR(94),IF(ISTEXT(Zakázka!E87),CHAR(32),Zakázka!E87))","v":"^"},{"$f":"IF(ISBLANK(Zakázka!E87),CHAR(32),Zakázka!E87)","v":" "},{"$f":"IF(ISBLANK(Zakázka!BG87),CHAR(32),Zakázka!BG87)","v":" "},{"$f":"IF(ISBLANK(Zakázka!BH87),CHAR(32),Zakázka!BH87)","v":" "},{"$f":"IF(ISBLANK(Zakázka!E87),CHAR(32),Zakázka!$I$11)","v":" "},{"$f":"IF(ISBLANK(Zakázka!E87),CHAR(32),Zakázka!$I$10)","v":" "},{"$f":"IF(ISBLANK(Zakázka!U87),CHAR(32),Zakázka!U87)","v":" "},{"$f":"IF(ISBLANK(Zakázka!S87),CHAR(32),Zakázka!S87)","v":" "},{"$f":"IF(ISBLANK(Zakázka!E87),CHAR(32),(Zakázka!$I$12))","v":" "}," "," ",{"$f":"IF(ISBLANK(Zakázka!BA87),CHAR(32),Zakázka!BA87)","v":""}]
[{"$f":"IF(ISBLANK(Zakázka!E88),CHAR(94),IF(ISTEXT(Zakázka!E88),CHAR(32),Zakázka!E88))","v":"^"},{"$f":"IF(ISBLANK(Zakázka!E88),CHAR(32),Zakázka!E88)","v":" "},{"$f":"IF(ISBLANK(Zakázka!BG88),CHAR(32),Zakázka!BG88)","v":" "},{"$f":"IF(ISBLANK(Zakázka!BH88),CHAR(32),Zakázka!BH88)","v":" "},{"$f":"IF(ISBLANK(Zakázka!E88),CHAR(32),Zakázka!$I$11)","v":" "},{"$f":"IF(ISBLANK(Zakázka!E88),CHAR(32),Zakázka!$I$10)","v":" "},{"$f":"IF(ISBLANK(Zakázka!U88),CHAR(32),Zakázka!U88)","v":" "},{"$f":"IF(ISBLANK(Zakázka!S88),CHAR(32),Zakázka!S88)","v":" "},{"$f":"IF(ISBLANK(Zakázka!E88),CHAR(32),(Zakázka!$I$12))","v":" "}," "," ",{"$f":"IF(ISBLANK(Zakázka!BA88),CHAR(32),Zakázka!BA88)","v":""}]
[{"$f":"IF(ISBLANK(Zakázka!E89),CHAR(94),IF(ISTEXT(Zakázka!E89),CHAR(32),Zakázka!E89))","v":"^"},{"$f":"IF(ISBLANK(Zakázka!E89),CHAR(32),Zakázka!E89)","v":" "},{"$f":"IF(ISBLANK(Zakázka!BG89),CHAR(32),Zakázka!BG89)","v":" "},{"$f":"IF(ISBLANK(Zakázka!BH89),CHAR(32),Zakázka!BH89)","v":" "},{"$f":"IF(ISBLANK(Zakázka!E89),CHAR(32),Zakázka!$I$11)","v":" "},{"$f":"IF(ISBLANK(Zakázka!E89),CHAR(32),Zakázka!$I$10)","v":" "},{"$f":"IF(ISBLANK(Zakázka!U89),CHAR(32),Zakázka!U89)","v":" "},{"$f":"IF(ISBLANK(Zakázka!S89),CHAR(32),Zakázka!S89)","v":" "},{"$f":"IF(ISBLANK(Zakázka!E89),CHAR(32),(Zakázka!$I$12))","v":" "}," "," ",{"$f":"IF(ISBLANK(Zakázka!BA89),CHAR(32),Zakázka!BA89)","v":""}]
[{"$f":"IF(ISBLANK(Zakázka!E90),CHAR(94),IF(ISTEXT(Zakázka!E90),CHAR(32),Zakázka!E90))","v":"^"},{"$f":"IF(ISBLANK(Zakázka!E90),CHAR(32),Zakázka!E90)","v":" "},{"$f":"IF(ISBLANK(Zakázka!BG90),CHAR(32),Zakázka!BG90)","v":" "},{"$f":"IF(ISBLANK(Zakázka!BH90),CHAR(32),Zakázka!BH90)","v":" "},{"$f":"IF(ISBLANK(Zakázka!E90),CHAR(32),Zakázka!$I$11)","v":" "},{"$f":"IF(ISBLANK(Zakázka!E90),CHAR(32),Zakázka!$I$10)","v":" "},{"$f":"IF(ISBLANK(Zakázka!U90),CHAR(32),Zakázka!U90)","v":" "},{"$f":"IF(ISBLANK(Zakázka!S90),CHAR(32),Zakázka!S90)","v":" "},{"$f":"IF(ISBLANK(Zakázka!E90),CHAR(32),(Zakázka!$I$12))","v":" "}," "," ",{"$f":"IF(ISBLANK(Zakázka!BA90),CHAR(32),Zakázka!BA90)","v":""}]
[{"$f":"IF(ISBLANK(Zakázka!E91),CHAR(94),IF(ISTEXT(Zakázka!E91),CHAR(32),Zakázka!E91))","v":"^"},{"$f":"IF(ISBLANK(Zakázka!E91),CHAR(32),Zakázka!E91)","v":" "},{"$f":"IF(ISBLANK(Zakázka!BG91),CHAR(32),Zakázka!BG91)","v":" "},{"$f":"IF(ISBLANK(Zakázka!BH91),CHAR(32),Zakázka!BH91)","v":" "},{"$f":"IF(ISBLANK(Zakázka!E91),CHAR(32),Zakázka!$I$11)","v":" "},{"$f":"IF(ISBLANK(Zakázka!E91),CHAR(32),Zakázka!$I$10)","v":" "},{"$f":"IF(ISBLANK(Zakázka!U91),CHAR(32),Zakázka!U91)","v":" "},{"$f":"IF(ISBLANK(Zakázka!S91),CHAR(32),Zakázka!S91)","v":" "},{"$f":"IF(ISBLANK(Zakázka!E91),CHAR(32),(Zakázka!$I$12))","v":" "}," "," ",{"$f":"IF(ISBLANK(Zakázka!BA91),CHAR(32),Zakázka!BA91)","v":""}]
[{"$f":"IF(ISBLANK(Zakázka!E92),CHAR(94),IF(ISTEXT(Zakázka!E92),CHAR(32),Zakázka!E92))","v":"^"},{"$f":"IF(ISBLANK(Zakázka!E92),CHAR(32),Zakázka!E92)","v":" "},{"$f":"IF(ISBLANK(Zakázka!BG92),CHAR(32),Zakázka!BG92)","v":" "},{"$f":"IF(ISBLANK(Zakázka!BH92),CHAR(32),Zakázka!BH92)","v":" "},{"$f":"IF(ISBLANK(Zakázka!E92),CHAR(32),Zakázka!$I$11)","v":" "},{"$f":"IF(ISBLANK(Zakázka!E92),CHAR(32),Zakázka!$I$10)","v":" "},{"$f":"IF(ISBLANK(Zakázka!U92),CHAR(32),Zakázka!U92)","v":" "},{"$f":"IF(ISBLANK(Zakázka!S92),CHAR(32),Zakázka!S92)","v":" "},{"$f":"IF(ISBLANK(Zakázka!E92),CHAR(32),(Zakázka!$I$12))","v":" "}," "," ",{"$f":"IF(ISBLANK(Zakázka!BA92),CHAR(32),Zakázka!BA92)","v":""}]
[{"$f":"IF(ISBLANK(Zakázka!E93),CHAR(94),IF(ISTEXT(Zakázka!E93),CHAR(32),Zakázka!E93))","v":"^"},{"$f":"IF(ISBLANK(Zakázka!E93),CHAR(32),Zakázka!E93)","v":" "},{"$f":"IF(ISBLANK(Zakázka!BG93),CHAR(32),Zakázka!BG93)","v":" "},{"$f":"IF(ISBLANK(Zakázka!BH93),CHAR(32),Zakázka!BH93)","v":" "},{"$f":"IF(ISBLANK(Zakázka!E93),CHAR(32),Zakázka!$I$11)","v":" "},{"$f":"IF(ISBLANK(Zakázka!E93),CHAR(32),Zakázka!$I$10)","v":" "},{"$f":"IF(ISBLANK(Zakázka!U93),CHAR(32),Zakázka!U93)","v":" "},{"$f":"IF(ISBLANK(Zakázka!S93),CHAR(32),Zakázka!S93)","v":" "},{"$f":"IF(ISBLANK(Zakázka!E93),CHAR(32),(Zakázka!$I$12))","v":" "}," "," ",{"$f":"IF(ISBLANK(Zakázka!BA93),CHAR(32),Zakázka!BA93)","v":""}]
[{"$f":"IF(ISBLANK(Zakázka!E94),CHAR(94),IF(ISTEXT(Zakázka!E94),CHAR(32),Zakázka!E94))","v":"^"},{"$f":"IF(ISBLANK(Zakázka!E94),CHAR(32),Zakázka!E94)","v":" "},{"$f":"IF(ISBLANK(Zakázka!BG94),CHAR(32),Zakázka!BG94)","v":" "},{"$f":"IF(ISBLANK(Zakázka!BH94),CHAR(32),Zakázka!BH94)","v":" "},{"$f":"IF(ISBLANK(Zakázka!E94),CHAR(32),Zakázka!$I$11)","v":" "},{"$f":"IF(ISBLANK(Zakázka!E94),CHAR(32),Zakázka!$I$10)","v":" "},{"$f":"IF(ISBLANK(Zakázka!U94),CHAR(32),Zakázka!U94)","v":" "},{"$f":"IF(ISBLANK(Zakázka!S94),CHAR(32),Zakázka!S94)","v":" "},{"$f":"IF(ISBLANK(Zakázka!E94),CHAR(32),(Zakázka!$I$12))","v":" "}," "," ",{"$f":"IF(ISBLANK(Zakázka!BA94),CHAR(32),Zakázka!BA94)","v":""}]
[{"$f":"IF(ISBLANK(Zakázka!E95),CHAR(94),IF(ISTEXT(Zakázka!E95),CHAR(32),Zakázka!E95))","v":"^"},{"$f":"IF(ISBLANK(Zakázka!E95),CHAR(32),Zakázka!E95)","v":" "},{"$f":"IF(ISBLANK(Zakázka!BG95),CHAR(32),Zakázka!BG95)","v":" "},{"$f":"IF(ISBLANK(Zakázka!BH95),CHAR(32),Zakázka!BH95)","v":" "},{"$f":"IF(ISBLANK(Zakázka!E95),CHAR(32),Zakázka!$I$11)","v":" "},{"$f":"IF(ISBLANK(Zakázka!E95),CHAR(32),Zakázka!$I$10)","v":" "},{"$f":"IF(ISBLANK(Zakázka!U95),CHAR(32),Zakázka!U95)","v":" "},{"$f":"IF(ISBLANK(Zakázka!S95),CHAR(32),Zakázka!S95)","v":" "},{"$f":"IF(ISBLANK(Zakázka!E95),CHAR(32),(Zakázka!$I$12))","v":" "}," "," ",{"$f":"IF(ISBLANK(Zakázka!BA95),CHAR(32),Zakázka!BA95)","v":""}]
[{"$f":"IF(ISBLANK(Zakázka!E96),CHAR(94),IF(ISTEXT(Zakázka!E96),CHAR(32),Zakázka!E96))","v":"^"},{"$f":"IF(ISBLANK(Zakázka!E96),CHAR(32),Zakázka!E96)","v":" "},{"$f":"IF(ISBLANK(Zakázka!BG96),CHAR(32),Zakázka!BG96)","v":" "},{"$f":"IF(ISBLANK(Zakázka!BH96),CHAR(32),Zakázka!BH96)","v":" "},{"$f":"IF(ISBLANK(Zakázka!E96),CHAR(32),Zakázka!$I$11)","v":" "},{"$f":"IF(ISBLANK(Zakázka!E96),CHAR(32),Zakázka!$I$10)","v":" "},{"$f":"IF(ISBLANK(Zakázka!U96),CHAR(32),Zakázka!U96)","v":" "},{"$f":"IF(ISBLANK(Zakázka!S96),CHAR(32),Zakázka!S96)","v":" "},{"$f":"IF(ISBLANK(Zakázka!E96),CHAR(32),(Zakázka!$I$12))","v":" "}," "," ",{"$f":"IF(ISBLANK(Zakázka!BA96),CHAR(32),Zakázka!BA96)","v":""}]
[{"$f":"IF(ISBLANK(Zakázka!E97),CHAR(94),IF(ISTEXT(Zakázka!E97),CHAR(32),Zakázka!E97))","v":"^"},{"$f":"IF(ISBLANK(Zakázka!E97),CHAR(32),Zakázka!E97)","v":" "},{"$f":"IF(ISBLANK(Zakázka!BG97),CHAR(32),Zakázka!BG97)","v":" "},{"$f":"IF(ISBLANK(Zakázka!BH97),CHAR(32),Zakázka!BH97)","v":" "},{"$f":"IF(ISBLANK(Zakázka!E97),CHAR(32),Zakázka!$I$11)","v":" "},{"$f":"IF(ISBLANK(Zakázka!E97),CHAR(32),Zakázka!$I$10)","v":" "},{"$f":"IF(ISBLANK(Zakázka!U97),CHAR(32),Zakázka!U97)","v":" "},{"$f":"IF(ISBLANK(Zakázka!S97),CHAR(32),Zakázka!S97)","v":" "},{"$f":"IF(ISBLANK(Zakázka!E97),CHAR(32),(Zakázka!$I$12))","v":" "}," "," ",{"$f":"IF(ISBLANK(Zakázka!BA97),CHAR(32),Zakázka!BA97)","v":""}]
[{"$f":"IF(ISBLANK(Zakázka!E98),CHAR(94),IF(ISTEXT(Zakázka!E98),CHAR(32),Zakázka!E98))","v":"^"},{"$f":"IF(ISBLANK(Zakázka!E98),CHAR(32),Zakázka!E98)","v":" "},{"$f":"IF(ISBLANK(Zakázka!BG98),CHAR(32),Zakázka!BG98)","v":" "},{"$f":"IF(ISBLANK(Zakázka!BH98),CHAR(32),Zakázka!BH98)","v":" "},{"$f":"IF(ISBLANK(Zakázka!E98),CHAR(32),Zakázka!$I$11)","v":" "},{"$f":"IF(ISBLANK(Zakázka!E98),CHAR(32),Zakázka!$I$10)","v":" "},{"$f":"IF(ISBLANK(Zakázka!U98),CHAR(32),Zakázka!U98)","v":" "},{"$f":"IF(ISBLANK(Zakázka!S98),CHAR(32),Zakázka!S98)","v":" "},{"$f":"IF(ISBLANK(Zakázka!E98),CHAR(32),(Zakázka!$I$12))","v":" "}," "," ",{"$f":"IF(ISBLANK(Zakázka!BA98),CHAR(32),Zakázka!BA98)","v":""}]
[{"$f":"IF(ISBLANK(Zakázka!E99),CHAR(94),IF(ISTEXT(Zakázka!E99),CHAR(32),Zakázka!E99))","v":"^"},{"$f":"IF(ISBLANK(Zakázka!E99),CHAR(32),Zakázka!E99)","v":" "},{"$f":"IF(ISBLANK(Zakázka!BG99),CHAR(32),Zakázka!BG99)","v":" "},{"$f":"IF(ISBLANK(Zakázka!BH99),CHAR(32),Zakázka!BH99)","v":" "},{"$f":"IF(ISBLANK(Zakázka!E99),CHAR(32),Zakázka!$I$11)","v":" "},{"$f":"IF(ISBLANK(Zakázka!E99),CHAR(32),Zakázka!$I$10)","v":" "},{"$f":"IF(ISBLANK(Zakázka!U99),CHAR(32),Zakázka!U99)","v":" "},{"$f":"IF(ISBLANK(Zakázka!S99),CHAR(32),Zakázka!S99)","v":" "},{"$f":"IF(ISBLANK(Zakázka!E99),CHAR(32),(Zakázka!$I$12))","v":" "}," "," ",{"$f":"IF(ISBLANK(Zakázka!BA99),CHAR(32),Zakázka!BA99)","v":""}]
[{"$f":"IF(ISBLANK(Zakázka!E100),CHAR(94),IF(ISTEXT(Zakázka!E100),CHAR(32),Zakázka!E100))","v":"^"},{"$f":"IF(ISBLANK(Zakázka!E100),CHAR(32),Zakázka!E100)","v":" "},{"$f":"IF(ISBLANK(Zakázka!BG100),CHAR(32),Zakázka!BG100)","v":" "},{"$f":"IF(ISBLANK(Zakázka!BH100),CHAR(32),Zakázka!BH100)","v":" "},{"$f":"IF(ISBLANK(Zakázka!E100),CHAR(32),Zakázka!$I$11)","v":" "},{"$f":"IF(ISBLANK(Zakázka!E100),CHAR(32),Zakázka!$I$10)","v":" "},{"$f":"IF(ISBLANK(Zakázka!U100),CHAR(32),Zakázka!U100)","v":" "},{"$f":"IF(ISBLANK(Zakázka!S100),CHAR(32),Zakázka!S100)","v":" "},{"$f":"IF(ISBLANK(Zakázka!E100),CHAR(32),(Zakázka!$I$12))","v":" "}," "," ",{"$f":"IF(ISBLANK(Zakázka!BA100),CHAR(32),Zakázka!BA100)","v":""}]
[{"$f":"IF(ISBLANK(Zakázka!E101),CHAR(94),IF(ISTEXT(Zakázka!E101),CHAR(32),Zakázka!E101))","v":"^"},{"$f":"IF(ISBLANK(Zakázka!E101),CHAR(32),Zakázka!E101)","v":" "},{"$f":"IF(ISBLANK(Zakázka!BG101),CHAR(32),Zakázka!BG101)","v":" "},{"$f":"IF(ISBLANK(Zakázka!BH101),CHAR(32),Zakázka!BH101)","v":" "},{"$f":"IF(ISBLANK(Zakázka!E101),CHAR(32),Zakázka!$I$11)","v":" "},{"$f":"IF(ISBLANK(Zakázka!E101),CHAR(32),Zakázka!$I$10)","v":" "},{"$f":"IF(ISBLANK(Zakázka!U101),CHAR(32),Zakázka!U101)","v":" "},{"$f":"IF(ISBLANK(Zakázka!S101),CHAR(32),Zakázka!S101)","v":" "},{"$f":"IF(ISBLANK(Zakázka!E101),CHAR(32),(Zakázka!$I$12))","v":" "}," "," ",{"$f":"IF(ISBLANK(Zakázka!BA101),CHAR(32),Zakázka!BA101)","v":""}]
[{"$f":"IF(ISBLANK(Zakázka!E102),CHAR(94),IF(ISTEXT(Zakázka!E102),CHAR(32),Zakázka!E102))","v":"^"},{"$f":"IF(ISBLANK(Zakázka!E102),CHAR(32),Zakázka!E102)","v":" "},{"$f":"IF(ISBLANK(Zakázka!BG102),CHAR(32),Zakázka!BG102)","v":" "},{"$f":"IF(ISBLANK(Zakázka!BH102),CHAR(32),Zakázka!BH102)","v":" "},{"$f":"IF(ISBLANK(Zakázka!E102),CHAR(32),Zakázka!$I$11)","v":" "},{"$f":"IF(ISBLANK(Zakázka!E102),CHAR(32),Zakázka!$I$10)","v":" "},{"$f":"IF(ISBLANK(Zakázka!U102),CHAR(32),Zakázka!U102)","v":" "},{"$f":"IF(ISBLANK(Zakázka!S102),CHAR(32),Zakázka!S102)","v":" "},{"$f":"IF(ISBLANK(Zakázka!E102),CHAR(32),(Zakázka!$I$12))","v":" "}," "," ",{"$f":"IF(ISBLANK(Zakázka!BA102),CHAR(32),Zakázka!BA102)","v":""}]
[{"$f":"IF(ISBLANK(Zakázka!E103),CHAR(94),IF(ISTEXT(Zakázka!E103),CHAR(32),Zakázka!E103))","v":"^"},{"$f":"IF(ISBLANK(Zakázka!E103),CHAR(32),Zakázka!E103)","v":" "},{"$f":"IF(ISBLANK(Zakázka!BG103),CHAR(32),Zakázka!BG103)","v":" "},{"$f":"IF(ISBLANK(Zakázka!BH103),CHAR(32),Zakázka!BH103)","v":" "},{"$f":"IF(ISBLANK(Zakázka!E103),CHAR(32),Zakázka!$I$11)","v":" "},{"$f":"IF(ISBLANK(Zakázka!E103),CHAR(32),Zakázka!$I$10)","v":" "},{"$f":"IF(ISBLANK(Zakázka!U103),CHAR(32),Zakázka!U103)","v":" "},{"$f":"IF(ISBLANK(Zakázka!S103),CHAR(32),Zakázka!S103)","v":" "},{"$f":"IF(ISBLANK(Zakázka!E103),CHAR(32),(Zakázka!$I$12))","v":" "}," "," ",{"$f":"IF(ISBLANK(Zakázka!BA103),CHAR(32),Zakázka!BA103)","v":""}]
[{"$f":"IF(ISBLANK(Zakázka!E104),CHAR(94),IF(ISTEXT(Zakázka!E104),CHAR(32),Zakázka!E104))","v":"^"},{"$f":"IF(ISBLANK(Zakázka!E104),CHAR(32),Zakázka!E104)","v":" "},{"$f":"IF(ISBLANK(Zakázka!BG104),CHAR(32),Zakázka!BG104)","v":" "},{"$f":"IF(ISBLANK(Zakázka!BH104),CHAR(32),Zakázka!BH104)","v":" "},{"$f":"IF(ISBLANK(Zakázka!E104),CHAR(32),Zakázka!$I$11)","v":" "},{"$f":"IF(ISBLANK(Zakázka!E104),CHAR(32),Zakázka!$I$10)","v":" "},{"$f":"IF(ISBLANK(Zakázka!U104),CHAR(32),Zakázka!U104)","v":" "},{"$f":"IF(ISBLANK(Zakázka!S104),CHAR(32),Zakázka!S104)","v":" "},{"$f":"IF(ISBLANK(Zakázka!E104),CHAR(32),(Zakázka!$I$12))","v":" "}," "," ",{"$f":"IF(ISBLANK(Zakázka!BA104),CHAR(32),Zakázka!BA104)","v":""}]
[{"$f":"IF(ISBLANK(Zakázka!E105),CHAR(94),IF(ISTEXT(Zakázka!E105),CHAR(32),Zakázka!E105))","v":"^"},{"$f":"IF(ISBLANK(Zakázka!E105),CHAR(32),Zakázka!E105)","v":" "},{"$f":"IF(ISBLANK(Zakázka!BG105),CHAR(32),Zakázka!BG105)","v":" "},{"$f":"IF(ISBLANK(Zakázka!BH105),CHAR(32),Zakázka!BH105)","v":" "},{"$f":"IF(ISBLANK(Zakázka!E105),CHAR(32),Zakázka!$I$11)","v":" "},{"$f":"IF(ISBLANK(Zakázka!E105),CHAR(32),Zakázka!$I$10)","v":" "},{"$f":"IF(ISBLANK(Zakázka!U105),CHAR(32),Zakázka!U105)","v":" "},{"$f":"IF(ISBLANK(Zakázka!S105),CHAR(32),Zakázka!S105)","v":" "},{"$f":"IF(ISBLANK(Zakázka!E105),CHAR(32),(Zakázka!$I$12))","v":" "}," "," ",{"$f":"IF(ISBLANK(Zakázka!BA105),CHAR(32),Zakázka!BA105)","v":""}]
[{"$f":"IF(ISBLANK(Zakázka!E106),CHAR(94),IF(ISTEXT(Zakázka!E106),CHAR(32),Zakázka!E106))","v":"^"},{"$f":"IF(ISBLANK(Zakázka!E106),CHAR(32),Zakázka!E106)","v":" "},{"$f":"IF(ISBLANK(Zakázka!BG106),CHAR(32),Zakázka!BG106)","v":" "},{"$f":"IF(ISBLANK(Zakázka!BH106),CHAR(32),Zakázka!BH106)","v":" "},{"$f":"IF(ISBLANK(Zakázka!E106),CHAR(32),Zakázka!$I$11)","v":" "},{"$f":"IF(ISBLANK(Zakázka!E106),CHAR(32),Zakázka!$I$10)","v":" "},{"$f":"IF(ISBLANK(Zakázka!U106),CHAR(32),Zakázka!U106)","v":" "},{"$f":"IF(ISBLANK(Zakázka!S106),CHAR(32),Zakázka!S106)","v":" "},{"$f":"IF(ISBLANK(Zakázka!E106),CHAR(32),(Zakázka!$I$12))","v":" "}," "," ",{"$f":"IF(ISBLANK(Zakázka!BA106),CHAR(32),Zakázka!BA106)","v":""}]
[{"$f":"IF(ISBLANK(Zakázka!E107),CHAR(94),IF(ISTEXT(Zakázka!E107),CHAR(32),Zakázka!E107))","v":"^"},{"$f":"IF(ISBLANK(Zakázka!E107),CHAR(32),Zakázka!E107)","v":" "},{"$f":"IF(ISBLANK(Zakázka!BG107),CHAR(32),Zakázka!BG107)","v":" "},{"$f":"IF(ISBLANK(Zakázka!BH107),CHAR(32),Zakázka!BH107)","v":" "},{"$f":"IF(ISBLANK(Zakázka!E107),CHAR(32),Zakázka!$I$11)","v":" "},{"$f":"IF(ISBLANK(Zakázka!E107),CHAR(32),Zakázka!$I$10)","v":" "},{"$f":"IF(ISBLANK(Zakázka!U107),CHAR(32),Zakázka!U107)","v":" "},{"$f":"IF(ISBLANK(Zakázka!S107),CHAR(32),Zakázka!S107)","v":" "},{"$f":"IF(ISBLANK(Zakázka!E107),CHAR(32),(Zakázka!$I$12))","v":" "}," "," ",{"$f":"IF(ISBLANK(Zakázka!BA107),CHAR(32),Zakázka!BA107)","v":""}]
[{"$f":"IF(ISBLANK(Zakázka!E108),CHAR(94),IF(ISTEXT(Zakázka!E108),CHAR(32),Zakázka!E108))","v":"^"},{"$f":"IF(ISBLANK(Zakázka!E108),CHAR(32),Zakázka!E108)","v":" "},{"$f":"IF(ISBLANK(Zakázka!BG108),CHAR(32),Zakázka!BG108)","v":" "},{"$f":"IF(ISBLANK(Zakázka!BH108),CHAR(32),Zakázka!BH108)","v":" "},{"$f":"IF(ISBLANK(Zakázka!E108),CHAR(32),Zakázka!$I$11)","v":" "},{"$f":"IF(ISBLANK(Zakázka!E108),CHAR(32),Zakázka!$I$10)","v":" "},{"$f":"IF(ISBLANK(Zakázka!U108),CHAR(32),Zakázka!U108)","v":" "},{"$f":"IF(ISBLANK(Zakázka!S108),CHAR(32),Zakázka!S108)","v":" "},{"$f":"IF(ISBLANK(Zakázka!E108),CHAR(32),(Zakázka!$I$12))","v":" "}," "," ",{"$f":"IF(ISBLANK(Zakázka!BA108),CHAR(32),Zakázka!BA108)","v":""}]
[{"$f":"IF(ISBLANK(Zakázka!E109),CHAR(94),IF(ISTEXT(Zakázka!E109),CHAR(32),Zakázka!E109))","v":"^"},{"$f":"IF(ISBLANK(Zakázka!E109),CHAR(32),Zakázka!E109)","v":" "},{"$f":"IF(ISBLANK(Zakázka!BG109),CHAR(32),Zakázka!BG109)","v":" "},{"$f":"IF(ISBLANK(Zakázka!BH109),CHAR(32),Zakázka!BH109)","v":" "},{"$f":"IF(ISBLANK(Zakázka!E109),CHAR(32),Zakázka!$I$11)","v":" "},{"$f":"IF(ISBLANK(Zakázka!E109),CHAR(32),Zakázka!$I$10)","v":" "},{"$f":"IF(ISBLANK(Zakázka!U109),CHAR(32),Zakázka!U109)","v":" "},{"$f":"IF(ISBLANK(Zakázka!S109),CHAR(32),Zakázka!S109)","v":" "},{"$f":"IF(ISBLANK(Zakázka!E109),CHAR(32),(Zakázka!$I$12))","v":" "}," "," ",{"$f":"IF(ISBLANK(Zakázka!BA109),CHAR(32),Zakázka!BA109)","v":""}]
[{"$f":"IF(ISBLANK(Zakázka!E110),CHAR(94),IF(ISTEXT(Zakázka!E110),CHAR(32),Zakázka!E110))","v":"^"},{"$f":"IF(ISBLANK(Zakázka!E110),CHAR(32),Zakázka!E110)","v":" "},{"$f":"IF(ISBLANK(Zakázka!BG110),CHAR(32),Zakázka!BG110)","v":" "},{"$f":"IF(ISBLANK(Zakázka!BH110),CHAR(32),Zakázka!BH110)","v":" "},{"$f":"IF(ISBLANK(Zakázka!E110),CHAR(32),Zakázka!$I$11)","v":" "},{"$f":"IF(ISBLANK(Zakázka!E110),CHAR(32),Zakázka!$I$10)","v":" "},{"$f":"IF(ISBLANK(Zakázka!U110),CHAR(32),Zakázka!U110)","v":" "},{"$f":"IF(ISBLANK(Zakázka!S110),CHAR(32),Zakázka!S110)","v":" "},{"$f":"IF(ISBLANK(Zakázka!E110),CHAR(32),(Zakázka!$I$12))","v":" "}," "," ",{"$f":"IF(ISBLANK(Zakázka!BA110),CHAR(32),Zakázka!BA110)","v":""}]
[{"$f":"IF(ISBLANK(Zakázka!E111),CHAR(94),IF(ISTEXT(Zakázka!E111),CHAR(32),Zakázka!E111))","v":"^"},{"$f":"IF(ISBLANK(Zakázka!E111),CHAR(32),Zakázka!E111)","v":" "},{"$f":"IF(ISBLANK(Zakázka!BG111),CHAR(32),Zakázka!BG111)","v":" "},{"$f":"IF(ISBLANK(Zakázka!BH111),CHAR(32),Zakázka!BH111)","v":" "},{"$f":"IF(ISBLANK(Zakázka!E111),CHAR(32),Zakázka!$I$11)","v":" "},{"$f":"IF(ISBLANK(Zakázka!E111),CHAR(32),Zakázka!$I$10)","v":" "},{"$f":"IF(ISBLANK(Zakázka!U111),CHAR(32),Zakázka!U111)","v":" "},{"$f":"IF(ISBLANK(Zakázka!S111),CHAR(32),Zakázka!S111)","v":" "},{"$f":"IF(ISBLANK(Zakázka!E111),CHAR(32),(Zakázka!$I$12))","v":" "}," "," ",{"$f":"IF(ISBLANK(Zakázka!BA111),CHAR(32),Zakázka!BA111)","v":""}]
[{"$f":"IF(ISBLANK(Zakázka!E112),CHAR(94),IF(ISTEXT(Zakázka!E112),CHAR(32),Zakázka!E112))","v":"^"},{"$f":"IF(ISBLANK(Zakázka!E112),CHAR(32),Zakázka!E112)","v":" "},{"$f":"IF(ISBLANK(Zakázka!BG112),CHAR(32),Zakázka!BG112)","v":" "},{"$f":"IF(ISBLANK(Zakázka!BH112),CHAR(32),Zakázka!BH112)","v":" "},{"$f":"IF(ISBLANK(Zakázka!E112),CHAR(32),Zakázka!$I$11)","v":" "},{"$f":"IF(ISBLANK(Zakázka!E112),CHAR(32),Zakázka!$I$10)","v":" "},{"$f":"IF(ISBLANK(Zakázka!U112),CHAR(32),Zakázka!U112)","v":" "},{"$f":"IF(ISBLANK(Zakázka!S112),CHAR(32),Zakázka!S112)","v":" "},{"$f":"IF(ISBLANK(Zakázka!E112),CHAR(32),(Zakázka!$I$12))","v":" "}," "," ",{"$f":"IF(ISBLANK(Zakázka!BA112),CHAR(32),Zakázka!BA112)","v":""}]
[{"$f":"IF(ISBLANK(Zakázka!E113),CHAR(94),IF(ISTEXT(Zakázka!E113),CHAR(32),Zakázka!E113))","v":"^"},{"$f":"IF(ISBLANK(Zakázka!E113),CHAR(32),Zakázka!E113)","v":" "},{"$f":"IF(ISBLANK(Zakázka!BG113),CHAR(32),Zakázka!BG113)","v":" "},{"$f":"IF(ISBLANK(Zakázka!BH113),CHAR(32),Zakázka!BH113)","v":" "},{"$f":"IF(ISBLANK(Zakázka!E113),CHAR(32),Zakázka!$I$11)","v":" "},{"$f":"IF(ISBLANK(Zakázka!E113),CHAR(32),Zakázka!$I$10)","v":" "},{"$f":"IF(ISBLANK(Zakázka!U113),CHAR(32),Zakázka!U113)","v":" "},{"$f":"IF(ISBLANK(Zakázka!S113),CHAR(32),Zakázka!S113)","v":" "},{"$f":"IF(ISBLANK(Zakázka!E113),CHAR(32),(Zakázka!$I$12))","v":" "}," "," ",{"$f":"IF(ISBLANK(Zakázka!BA113),CHAR(32),Zakázka!BA113)","v":""}]
[{"$f":"IF(ISBLANK(Zakázka!E114),CHAR(94),IF(ISTEXT(Zakázka!E114),CHAR(32),Zakázka!E114))","v":"^"},{"$f":"IF(ISBLANK(Zakázka!E114),CHAR(32),Zakázka!E114)","v":" "},{"$f":"IF(ISBLANK(Zakázka!BG114),CHAR(32),Zakázka!BG114)","v":" "},{"$f":"IF(ISBLANK(Zakázka!BH114),CHAR(32),Zakázka!BH114)","v":" "},{"$f":"IF(ISBLANK(Zakázka!E114),CHAR(32),Zakázka!$I$11)","v":" "},{"$f":"IF(ISBLANK(Zakázka!E114),CHAR(32),Zakázka!$I$10)","v":" "},{"$f":"IF(ISBLANK(Zakázka!U114),CHAR(32),Zakázka!U114)","v":" "},{"$f":"IF(ISBLANK(Zakázka!S114),CHAR(32),Zakázka!S114)","v":" "},{"$f":"IF(ISBLANK(Zakázka!E114),CHAR(32),(Zakázka!$I$12))","v":" "}," "," ",{"$f":"IF(ISBLANK(Zakázka!BA114),CHAR(32),Zakázka!BA114)","v":""}]
[{"$f":"IF(ISBLANK(Zakázka!E115),CHAR(94),IF(ISTEXT(Zakázka!E115),CHAR(32),Zakázka!E115))","v":"^"},{"$f":"IF(ISBLANK(Zakázka!E115),CHAR(32),Zakázka!E115)","v":" "},{"$f":"IF(ISBLANK(Zakázka!BG115),CHAR(32),Zakázka!BG115)","v":" "},{"$f":"IF(ISBLANK(Zakázka!BH115),CHAR(32),Zakázka!BH115)","v":" "},{"$f":"IF(ISBLANK(Zakázka!E115),CHAR(32),Zakázka!$I$11)","v":" "},{"$f":"IF(ISBLANK(Zakázka!E115),CHAR(32),Zakázka!$I$10)","v":" "},{"$f":"IF(ISBLANK(Zakázka!U115),CHAR(32),Zakázka!U115)","v":" "},{"$f":"IF(ISBLANK(Zakázka!S115),CHAR(32),Zakázka!S115)","v":" "},{"$f":"IF(ISBLANK(Zakázka!E115),CHAR(32),(Zakázka!$I$12))","v":" "}," "," ",{"$f":"IF(ISBLANK(Zakázka!BA115),CHAR(32),Zakázka!BA115)","v":""}]
[{"$f":"IF(ISBLANK(Zakázka!E116),CHAR(94),IF(ISTEXT(Zakázka!E116),CHAR(32),Zakázka!E116))","v":"^"},{"$f":"IF(ISBLANK(Zakázka!E116),CHAR(32),Zakázka!E116)","v":" "},{"$f":"IF(ISBLANK(Zakázka!BG116),CHAR(32),Zakázka!BG116)","v":" "},{"$f":"IF(ISBLANK(Zakázka!BH116),CHAR(32),Zakázka!BH116)","v":" "},{"$f":"IF(ISBLANK(Zakázka!E116),CHAR(32),Zakázka!$I$11)","v":" "},{"$f":"IF(ISBLANK(Zakázka!E116),CHAR(32),Zakázka!$I$10)","v":" "},{"$f":"IF(ISBLANK(Zakázka!U116),CHAR(32),Zakázka!U116)","v":" "},{"$f":"IF(ISBLANK(Zakázka!S116),CHAR(32),Zakázka!S116)","v":" "},{"$f":"IF(ISBLANK(Zakázka!E116),CHAR(32),(Zakázka!$I$12))","v":" "}," "," ",{"$f":"IF(ISBLANK(Zakázka!BA116),CHAR(32),Zakázka!BA116)","v":""}]
[{"$f":"IF(ISBLANK(Zakázka!E117),CHAR(94),IF(ISTEXT(Zakázka!E117),CHAR(32),Zakázka!E117))","v":"^"},{"$f":"IF(ISBLANK(Zakázka!E117),CHAR(32),Zakázka!E117)","v":" "},{"$f":"IF(ISBLANK(Zakázka!BG117),CHAR(32),Zakázka!BG117)","v":" "},{"$f":"IF(ISBLANK(Zakázka!BH117),CHAR(32),Zakázka!BH117)","v":" "},{"$f":"IF(ISBLANK(Zakázka!E117),CHAR(32),Zakázka!$I$11)","v":" "},{"$f":"IF(ISBLANK(Zakázka!E117),CHAR(32),Zakázka!$I$10)","v":" "},{"$f":"IF(ISBLANK(Zakázka!U117),CHAR(32),Zakázka!U117)","v":" "},{"$f":"IF(ISBLANK(Zakázka!S117),CHAR(32),Zakázka!S117)","v":" "},{"$f":"IF(ISBLANK(Zakázka!E117),CHAR(32),(Zakázka!$I$12))","v":" "}," "," ",{"$f":"IF(ISBLANK(Zakázka!BA117),CHAR(32),Zakázka!BA117)","v":""}]
[{"$f":"IF(ISBLANK(Zakázka!E118),CHAR(94),IF(ISTEXT(Zakázka!E118),CHAR(32),Zakázka!E118))","v":"^"},{"$f":"IF(ISBLANK(Zakázka!E118),CHAR(32),Zakázka!E118)","v":" "},{"$f":"IF(ISBLANK(Zakázka!BG118),CHAR(32),Zakázka!BG118)","v":" "},{"$f":"IF(ISBLANK(Zakázka!BH118),CHAR(32),Zakázka!BH118)","v":" "},{"$f":"IF(ISBLANK(Zakázka!E118),CHAR(32),Zakázka!$I$11)","v":" "},{"$f":"IF(ISBLANK(Zakázka!E118),CHAR(32),Zakázka!$I$10)","v":" "},{"$f":"IF(ISBLANK(Zakázka!U118),CHAR(32),Zakázka!U118)","v":" "},{"$f":"IF(ISBLANK(Zakázka!S118),CHAR(32),Zakázka!S118)","v":" "},{"$f":"IF(ISBLANK(Zakázka!E118),CHAR(32),(Zakázka!$I$12))","v":" "}," "," ",{"$f":"IF(ISBLANK(Zakázka!BA118),CHAR(32),Zakázka!BA118)","v":""}]
[{"$f":"IF(ISBLANK(Zakázka!E119),CHAR(94),IF(ISTEXT(Zakázka!E119),CHAR(32),Zakázka!E119))","v":"^"},{"$f":"IF(ISBLANK(Zakázka!E119),CHAR(32),Zakázka!E119)","v":" "},{"$f":"IF(ISBLANK(Zakázka!BG119),CHAR(32),Zakázka!BG119)","v":" "},{"$f":"IF(ISBLANK(Zakázka!BH119),CHAR(32),Zakázka!BH119)","v":" "},{"$f":"IF(ISBLANK(Zakázka!E119),CHAR(32),Zakázka!$I$11)","v":" "},{"$f":"IF(ISBLANK(Zakázka!E119),CHAR(32),Zakázka!$I$10)","v":" "},{"$f":"IF(ISBLANK(Zakázka!U119),CHAR(32),Zakázka!U119)","v":" "},{"$f":"IF(ISBLANK(Zakázka!S119),CHAR(32),Zakázka!S119)","v":" "},{"$f":"IF(ISBLANK(Zakázka!E119),CHAR(32),(Zakázka!$I$12))","v":" "}," "," ",{"$f":"IF(ISBLANK(Zakázka!BA119),CHAR(32),Zakázka!BA119)","v":""}]
[{"$f":"IF(ISBLANK(Zakázka!E120),CHAR(94),IF(ISTEXT(Zakázka!E120),CHAR(32),Zakázka!E120))","v":"^"},{"$f":"IF(ISBLANK(Zakázka!E120),CHAR(32),Zakázka!E120)","v":" "},{"$f":"IF(ISBLANK(Zakázka!BG120),CHAR(32),Zakázka!BG120)","v":" "},{"$f":"IF(ISBLANK(Zakázka!BH120),CHAR(32),Zakázka!BH120)","v":" "},{"$f":"IF(ISBLANK(Zakázka!E120),CHAR(32),Zakázka!$I$11)","v":" "},{"$f":"IF(ISBLANK(Zakázka!E120),CHAR(32),Zakázka!$I$10)","v":" "},{"$f":"IF(ISBLANK(Zakázka!U120),CHAR(32),Zakázka!U120)","v":" "},{"$f":"IF(ISBLANK(Zakázka!S120),CHAR(32),Zakázka!S120)","v":" "},{"$f":"IF(ISBLANK(Zakázka!E120),CHAR(32),(Zakázka!$I$12))","v":" "}," "," ",{"$f":"IF(ISBLANK(Zakázka!BA120),CHAR(32),Zakázka!BA120)","v":""}]
[{"$f":"IF(ISBLANK(Zakázka!E121),CHAR(94),IF(ISTEXT(Zakázka!E121),CHAR(32),Zakázka!E121))","v":"^"},{"$f":"IF(ISBLANK(Zakázka!E121),CHAR(32),Zakázka!E121)","v":" "},{"$f":"IF(ISBLANK(Zakázka!BG121),CHAR(32),Zakázka!BG121)","v":" "},{"$f":"IF(ISBLANK(Zakázka!BH121),CHAR(32),Zakázka!BH121)","v":" "},{"$f":"IF(ISBLANK(Zakázka!E121),CHAR(32),Zakázka!$I$11)","v":" "},{"$f":"IF(ISBLANK(Zakázka!E121),CHAR(32),Zakázka!$I$10)","v":" "},{"$f":"IF(ISBLANK(Zakázka!U121),CHAR(32),Zakázka!U121)","v":" "},{"$f":"IF(ISBLANK(Zakázka!S121),CHAR(32),Zakázka!S121)","v":" "},{"$f":"IF(ISBLANK(Zakázka!E121),CHAR(32),(Zakázka!$I$12))","v":" "}," "," ",{"$f":"IF(ISBLANK(Zakázka!BA121),CHAR(32),Zakázka!BA121)","v":""}]
[{"$f":"IF(ISBLANK(Zakázka!E122),CHAR(94),IF(ISTEXT(Zakázka!E122),CHAR(32),Zakázka!E122))","v":"^"},{"$f":"IF(ISBLANK(Zakázka!E122),CHAR(32),Zakázka!E122)","v":" "},{"$f":"IF(ISBLANK(Zakázka!BG122),CHAR(32),Zakázka!BG122)","v":" "},{"$f":"IF(ISBLANK(Zakázka!BH122),CHAR(32),Zakázka!BH122)","v":" "},{"$f":"IF(ISBLANK(Zakázka!E122),CHAR(32),Zakázka!$I$11)","v":" "},{"$f":"IF(ISBLANK(Zakázka!E122),CHAR(32),Zakázka!$I$10)","v":" "},{"$f":"IF(ISBLANK(Zakázka!U122),CHAR(32),Zakázka!U122)","v":" "},{"$f":"IF(ISBLANK(Zakázka!S122),CHAR(32),Zakázka!S122)","v":" "},{"$f":"IF(ISBLANK(Zakázka!E122),CHAR(32),(Zakázka!$I$12))","v":" "}," "," ",{"$f":"IF(ISBLANK(Zakázka!BA122),CHAR(32),Zakázka!BA122)","v":""}]
[null,{"$f":"IF(ISBLANK(Zakázka!E123),CHAR(32),Zakázka!E123)","v":" "},{"$f":"IF(ISBLANK(Zakázka!BG123),CHAR(32),Zakázka!BG123)","v":" "},{"$f":"IF(ISBLANK(Zakázka!BH123),CHAR(32),Zakázka!BH123)","v":" "},{"$f":"IF(ISBLANK(Zakázka!E123),CHAR(32),Zakázka!$I$11)","v":" "},{"$f":"IF(ISBLANK(Zakázka!E123),CHAR(32),Zakázka!$I$10)","v":" "},{"$f":"IF(ISBLANK(Zakázka!U123),CHAR(32),Zakázka!U123)","v":" "},{"$f":"IF(ISBLANK(Zakázka!S123),CHAR(32),Zakázka!S123)","v":" "},{"$f":"IF(ISBLANK(Zakázka!E123),CHAR(32),(Zakázka!$I$12))","v":" "}," "," ",{"$f":"IF(ISBLANK(Zakázka!BA123),CHAR(32),Zakázka!BA123)","v":""}]
[null,{"$f":"IF(ISBLANK(Zakázka!E124),CHAR(32),Zakázka!E124)","v":" "},{"$f":"IF(ISBLANK(Zakázka!BG124),CHAR(32),Zakázka!BG124)","v":" "},{"$f":"IF(ISBLANK(Zakázka!BH124),CHAR(32),Zakázka!BH124)","v":" "},{"$f":"IF(ISBLANK(Zakázka!E124),CHAR(32),Zakázka!$I$11)","v":" "},{"$f":"IF(ISBLANK(Zakázka!E124),CHAR(32),Zakázka!$I$10)","v":" "},{"$f":"IF(ISBLANK(Zakázka!U124),CHAR(32),Zakázka!U124)","v":" "},{"$f":"IF(ISBLANK(Zakázka!S124),CHAR(32),Zakázka!S124)","v":" "},{"$f":"IF(ISBLANK(Zakázka!E124),CHAR(32),(Zakázka!$I$12))","v":" "}," "," ",{"$f":"IF(ISBLANK(Zakázka!BA124),CHAR(32),Zakázka!BA124)","v":""}]
[null,{"$f":"IF(ISBLANK(Zakázka!E125),CHAR(32),Zakázka!E125)","v":" "},{"$f":"IF(ISBLANK(Zakázka!BG125),CHAR(32),Zakázka!BG125)","v":" "},{"$f":"IF(ISBLANK(Zakázka!BH125),CHAR(32),Zakázka!BH125)","v":" "},{"$f":"IF(ISBLANK(Zakázka!E125),CHAR(32),Zakázka!$I$11)","v":" "},{"$f":"IF(ISBLANK(Zakázka!E125),CHAR(32),Zakázka!$I$10)","v":" "},{"$f":"IF(ISBLANK(Zakázka!U125),CHAR(32),Zakázka!U125)","v":" "},{"$f":"IF(ISBLANK(Zakázka!S125),CHAR(32),Zakázka!S125)","v":" "},{"$f":"IF(ISBLANK(Zakázka!E125),CHAR(32),(Zakázka!$I$12))","v":" "}," "," ",{"$f":"IF(ISBLANK(Zakázka!BA125),CHAR(32),Zakázka!BA125)","v":""}]
[null,{"$f":"IF(ISBLANK(Zakázka!E126),CHAR(32),Zakázka!E126)","v":" "},{"$f":"IF(ISBLANK(Zakázka!BG126),CHAR(32),Zakázka!BG126)","v":" "},{"$f":"IF(ISBLANK(Zakázka!BH126),CHAR(32),Zakázka!BH126)","v":" "},{"$f":"IF(ISBLANK(Zakázka!E126),CHAR(32),Zakázka!$I$11)","v":" "},{"$f":"IF(ISBLANK(Zakázka!E126),CHAR(32),Zakázka!$I$10)","v":" "},{"$f":"IF(ISBLANK(Zakázka!U126),CHAR(32),Zakázka!U126)","v":" "},{"$f":"IF(ISBLANK(Zakázka!S126),CHAR(32),Zakázka!S126)","v":" "},{"$f":"IF(ISBLANK(Zakázka!E126),CHAR(32),(Zakázka!$I$12))","v":" "}," "," ",{"$f":"IF(ISBLANK(Zakázka!BA126),CHAR(32),Zakázka!BA126)","v":" "}]
[null,{"$f":"IF(ISBLANK(Zakázka!E127),CHAR(32),Zakázka!E127)","v":" "},{"$f":"IF(ISBLANK(Zakázka!BG127),CHAR(32),Zakázka!BG127)","v":" "},{"$f":"IF(ISBLANK(Zakázka!BH127),CHAR(32),Zakázka!BH127)","v":" "},{"$f":"IF(ISBLANK(Zakázka!E127),CHAR(32),Zakázka!$I$11)","v":" "},{"$f":"IF(ISBLANK(Zakázka!E127),CHAR(32),Zakázka!$I$10)","v":" "},{"$f":"IF(ISBLANK(Zakázka!U127),CHAR(32),Zakázka!U127)","v":" "},{"$f":"IF(ISBLANK(Zakázka!S127),CHAR(32),Zakázka!S127)","v":" "},{"$f":"IF(ISBLANK(Zakázka!E127),CHAR(32),(Zakázka!$I$12))","v":" "}," "," ",{"$f":"IF(ISBLANK(Zakázka!BA127),CHAR(32),Zakázka!BA127)","v":" "}]
[null,{"$f":"IF(ISBLANK(Zakázka!E128),CHAR(32),Zakázka!E128)","v":" "},{"$f":"IF(ISBLANK(Zakázka!BG128),CHAR(32),Zakázka!BG128)","v":" "},{"$f":"IF(ISBLANK(Zakázka!BH128),CHAR(32),Zakázka!BH128)","v":" "},{"$f":"IF(ISBLANK(Zakázka!E128),CHAR(32),Zakázka!$I$11)","v":" "},{"$f":"IF(ISBLANK(Zakázka!E128),CHAR(32),Zakázka!$I$10)","v":" "},{"$f":"IF(ISBLANK(Zakázka!U128),CHAR(32),Zakázka!U128)","v":" "},{"$f":"IF(ISBLANK(Zakázka!S128),CHAR(32),Zakázka!S128)","v":" "},{"$f":"IF(ISBLANK(Zakázka!E128),CHAR(32),(Zakázka!$I$12))","v":" "}," "," ",{"$f":"IF(ISBLANK(Zakázka!BA128),CHAR(32),Zakázka!BA128)","v":" "}]
[null,{"$f":"IF(ISBLANK(Zakázka!E129),CHAR(32),Zakázka!E129)","v":" "},{"$f":"IF(ISBLANK(Zakázka!BG129),CHAR(32),Zakázka!BG129)","v":" "},{"$f":"IF(ISBLANK(Zakázka!BH129),CHAR(32),Zakázka!BH129)","v":" "},{"$f":"IF(ISBLANK(Zakázka!E129),CHAR(32),Zakázka!$I$11)","v":" "},{"$f":"IF(ISBLANK(Zakázka!E129),CHAR(32),Zakázka!$I$10)","v":" "},{"$f":"IF(ISBLANK(Zakázka!U129),CHAR(32),Zakázka!U129)","v":" "},{"$f":"IF(ISBLANK(Zakázka!S129),CHAR(32),Zakázka!S129)","v":" "},{"$f":"IF(ISBLANK(Zakázka!E129),CHAR(32),(Zakázka!$I$12))","v":" "}," "," ",{"$f":"IF(ISBLANK(Zakázka!BA129),CHAR(32),Zakázka!BA129)","v":" "}]
[null,{"$f":"IF(ISBLANK(Zakázka!E130),CHAR(32),Zakázka!E130)","v":" "},{"$f":"IF(ISBLANK(Zakázka!BG130),CHAR(32),Zakázka!BG130)","v":" "},{"$f":"IF(ISBLANK(Zakázka!BH130),CHAR(32),Zakázka!BH130)","v":" "},{"$f":"IF(ISBLANK(Zakázka!E130),CHAR(32),Zakázka!$I$11)","v":" "},{"$f":"IF(ISBLANK(Zakázka!E130),CHAR(32),Zakázka!$I$10)","v":" "},{"$f":"IF(ISBLANK(Zakázka!U130),CHAR(32),Zakázka!U130)","v":" "},{"$f":"IF(ISBLANK(Zakázka!S130),CHAR(32),Zakázka!S130)","v":" "},{"$f":"IF(ISBLANK(Zakázka!E130),CHAR(32),(Zakázka!$I$12))","v":" "}," "," ",{"$f":"IF(ISBLANK(Zakázka!BA130),CHAR(32),Zakázka!BA130)","v":" "}]
[null,{"$f":"IF(ISBLANK(Zakázka!E131),CHAR(32),Zakázka!E131)","v":" "},{"$f":"IF(ISBLANK(Zakázka!BG131),CHAR(32),Zakázka!BG131)","v":" "},{"$f":"IF(ISBLANK(Zakázka!BH131),CHAR(32),Zakázka!BH131)","v":" "},{"$f":"IF(ISBLANK(Zakázka!E131),CHAR(32),Zakázka!$I$11)","v":" "},{"$f":"IF(ISBLANK(Zakázka!E131),CHAR(32),Zakázka!$I$10)","v":" "},{"$f":"IF(ISBLANK(Zakázka!U131),CHAR(32),Zakázka!U131)","v":" "},{"$f":"IF(ISBLANK(Zakázka!S131),CHAR(32),Zakázka!S131)","v":" "},{"$f":"IF(ISBLANK(Zakázka!E131),CHAR(32),(Zakázka!$I$12))","v":" "}," "," ",{"$f":"IF(ISBLANK(Zakázka!BA131),CHAR(32),Zakázka!BA131)","v":" "}]
[null,{"$f":"IF(ISBLANK(Zakázka!E132),CHAR(32),Zakázka!E132)","v":" "},{"$f":"IF(ISBLANK(Zakázka!BG132),CHAR(32),Zakázka!BG132)","v":" "},{"$f":"IF(ISBLANK(Zakázka!BH132),CHAR(32),Zakázka!BH132)","v":" "},{"$f":"IF(ISBLANK(Zakázka!E132),CHAR(32),Zakázka!$I$11)","v":" "},{"$f":"IF(ISBLANK(Zakázka!E132),CHAR(32),Zakázka!$I$10)","v":" "},{"$f":"IF(ISBLANK(Zakázka!U132),CHAR(32),Zakázka!U132)","v":" "},{"$f":"IF(ISBLANK(Zakázka!S132),CHAR(32),Zakázka!S132)","v":" "},{"$f":"IF(ISBLANK(Zakázka!E132),CHAR(32),(Zakázka!$I$12))","v":" "}," "," ",{"$f":"IF(ISBLANK(Zakázka!BA132),CHAR(32),Zakázka!BA132)","v":" "}]
[null,{"$f":"IF(ISBLANK(Zakázka!E133),CHAR(32),Zakázka!E133)","v":" "},{"$f":"IF(ISBLANK(Zakázka!BG133),CHAR(32),Zakázka!BG133)","v":" "},{"$f":"IF(ISBLANK(Zakázka!BH133),CHAR(32),Zakázka!BH133)","v":" "},{"$f":"IF(ISBLANK(Zakázka!E133),CHAR(32),Zakázka!$I$11)","v":" "},{"$f":"IF(ISBLANK(Zakázka!E133),CHAR(32),Zakázka!$I$10)","v":" "},{"$f":"IF(ISBLANK(Zakázka!U133),CHAR(32),Zakázka!U133)","v":" "},{"$f":"IF(ISBLANK(Zakázka!S133),CHAR(32),Zakázka!S133)","v":" "},{"$f":"IF(ISBLANK(Zakázka!E133),CHAR(32),(Zakázka!$I$12))","v":" "}," "," ",{"$f":"IF(ISBLANK(Zakázka!BA133),CHAR(32),Zakázka!BA133)","v":" "}]
[null,{"$f":"IF(ISBLANK(Zakázka!E134),CHAR(32),Zakázka!E134)","v":" "},{"$f":"IF(ISBLANK(Zakázka!BG134),CHAR(32),Zakázka!BG134)","v":" "},{"$f":"IF(ISBLANK(Zakázka!BH134),CHAR(32),Zakázka!BH134)","v":" "},{"$f":"IF(ISBLANK(Zakázka!E134),CHAR(32),Zakázka!$I$11)","v":" "},{"$f":"IF(ISBLANK(Zakázka!E134),CHAR(32),Zakázka!$I$10)","v":" "},{"$f":"IF(ISBLANK(Zakázka!U134),CHAR(32),Zakázka!U134)","v":" "},{"$f":"IF(ISBLANK(Zakázka!S134),CHAR(32),Zakázka!S134)","v":" "},{"$f":"IF(ISBLANK(Zakázka!E134),CHAR(32),(Zakázka!$I$12))","v":" "}," "," ",{"$f":"IF(ISBLANK(Zakázka!BA134),CHAR(32),Zakázka!BA134)","v":" "}]
[null,{"$f":"IF(ISBLANK(Zakázka!E135),CHAR(32),Zakázka!E135)","v":" "},{"$f":"IF(ISBLANK(Zakázka!BG135),CHAR(32),Zakázka!BG135)","v":" "},{"$f":"IF(ISBLANK(Zakázka!BH135),CHAR(32),Zakázka!BH135)","v":" "},{"$f":"IF(ISBLANK(Zakázka!E135),CHAR(32),Zakázka!$I$11)","v":" "},{"$f":"IF(ISBLANK(Zakázka!E135),CHAR(32),Zakázka!$I$10)","v":" "},{"$f":"IF(ISBLANK(Zakázka!U135),CHAR(32),Zakázka!U135)","v":" "},{"$f":"IF(ISBLANK(Zakázka!S135),CHAR(32),Zakázka!S135)","v":" "},{"$f":"IF(ISBLANK(Zakázka!E135),CHAR(32),(Zakázka!$I$12))","v":" "}," "," ",{"$f":"IF(ISBLANK(Zakázka!BA135),CHAR(32),Zakázka!BA135)","v":" "}]
[null,{"$f":"IF(ISBLANK(Zakázka!E136),CHAR(32),Zakázka!E136)","v":" "},{"$f":"IF(ISBLANK(Zakázka!BG136),CHAR(32),Zakázka!BG136)","v":" "},{"$f":"IF(ISBLANK(Zakázka!BH136),CHAR(32),Zakázka!BH136)","v":" "},{"$f":"IF(ISBLANK(Zakázka!E136),CHAR(32),Zakázka!$I$11)","v":" "},{"$f":"IF(ISBLANK(Zakázka!E136),CHAR(32),Zakázka!$I$10)","v":" "},{"$f":"IF(ISBLANK(Zakázka!U136),CHAR(32),Zakázka!U136)","v":" "},{"$f":"IF(ISBLANK(Zakázka!S136),CHAR(32),Zakázka!S136)","v":" "},{"$f":"IF(ISBLANK(Zakázka!E136),CHAR(32),(Zakázka!$I$12))","v":" "}," "," ",{"$f":"IF(ISBLANK(Zakázka!BA136),CHAR(32),Zakázka!BA136)","v":" "}]
[null,{"$f":"IF(ISBLANK(Zakázka!E137),CHAR(32),Zakázka!E137)","v":" "},{"$f":"IF(ISBLANK(Zakázka!BG137),CHAR(32),Zakázka!BG137)","v":" "},{"$f":"IF(ISBLANK(Zakázka!BH137),CHAR(32),Zakázka!BH137)","v":" "},{"$f":"IF(ISBLANK(Zakázka!E137),CHAR(32),Zakázka!$I$11)","v":" "},{"$f":"IF(ISBLANK(Zakázka!E137),CHAR(32),Zakázka!$I$10)","v":" "},{"$f":"IF(ISBLANK(Zakázka!U137),CHAR(32),Zakázka!U137)","v":" "},{"$f":"IF(ISBLANK(Zakázka!S137),CHAR(32),Zakázka!S137)","v":" "},{"$f":"IF(ISBLANK(Zakázka!E137),CHAR(32),(Zakázka!$I$12))","v":" "}," "," ",{"$f":"IF(ISBLANK(Zakázka!BA137),CHAR(32),Zakázka!BA137)","v":" "}]
[null,{"$f":"IF(ISBLANK(Zakázka!E138),CHAR(32),Zakázka!E138)","v":" "},{"$f":"IF(ISBLANK(Zakázka!BG138),CHAR(32),Zakázka!BG138)","v":" "},{"$f":"IF(ISBLANK(Zakázka!BH138),CHAR(32),Zakázka!BH138)","v":" "},{"$f":"IF(ISBLANK(Zakázka!E138),CHAR(32),Zakázka!$I$11)","v":" "},{"$f":"IF(ISBLANK(Zakázka!E138),CHAR(32),Zakázka!$I$10)","v":" "},{"$f":"IF(ISBLANK(Zakázka!U138),CHAR(32),Zakázka!U138)","v":" "},{"$f":"IF(ISBLANK(Zakázka!S138),CHAR(32),Zakázka!S138)","v":" "},{"$f":"IF(ISBLANK(Zakázka!E138),CHAR(32),(Zakázka!$I$12))","v":" "}," "," ",{"$f":"IF(ISBLANK(Zakázka!BA138),CHAR(32),Zakázka!BA138)","v":" "}]